{"text_format":"1","workbook":"xlsx","n_sheets":10,"sheets":["Home","DATA UMUM","DATA KAS","DATA LAMPIRAN","KUITANSI UMUM","SPMB","SP. Tugas","Daftar Penerima","L. UPAH KERJA","L. Rapat"],"not_rendered":{"charts":0,"images":3,"macros":1,"external_links":0,"defined_names":27,"comments":2,"pivot_tables":0},"unopened":[],"bounds":{"document_bytes":16777216,"sheet_cells":100000,"rows_first":2000,"rows_last":500,"rows_between":2000,"halvings":0,"cell_chars":16384,"cell_head_chars":4096},"cells_cut":0,"cells_raw":0,"read":"whole","date_system":"1900"}

{"sheet":"Home","index":0,"n_rows":20,"n_cols":2,"rows_kept":20,"cut":false,"hidden":false,"merged":[[15,1,15,10],[16,1,16,10],[14,1,14,10]]}
[]
[]
[]
[]
[]
[]
[]
[]
[]
[]
[]
[]
[]
[]
[null,"Dibuat oleh Aris Pratama, S.Pd."]
{"$rows_left_out":6}
{"sheet":"DATA UMUM","index":1,"n_rows":503,"n_cols":11,"rows_kept":503,"cut":false,"hidden":false,"merged":[]}
[]
[null,"NAMA SEKOLAH",":","SD Ninja 01 Konoha",null,null,"BPU01",null,"Nama Toko","Nomor Telepon/HP","Alamat"]
[null,"TEMPAT (UTK TANGGAL NOTA)",":","Sungai Merah"]
[null,"NAMA KEPALA SEKOLAH",":","Shikamaru, S.Pd.",null,null,"BPU02",null,"Toko Senjata Tenten","005003","Jalan Ninja Nomor 2, Desa Konohagakure, Negara Api"]
[null,"NIP KEPALA SEKOLAH",":","012611",null,null,"BPU03",null,"Toko Percetakan Choji","006000","Jalan Ninja Nomor 2, Desa Konohagakure, Negara Api"]
[null,"NAMA BENDAHARA",":","Temari, S.Pd.",null,null,"BPU04",null,"Ichiraku Ramen","009000","Jalan Ninja Nomor 1, Desa Konohagakure, Negara Api"]
[null,"NIP BENDAHARA",":","53-004",null,null,"BPU05",null,"Toko Hyuga","002002","Jalan Ninja Nomor 3, Desa Konohagakure, Negara Api"]
[null,"SUMBER DANA",":","BOSP Tahap I"]
[null,"TAHUN",":",2024,null,null,"BPU06"]
[null,"Alamat Sekolah",":","Desa Konohagakure, Negara Api. 666",null,null,"BPU07"]
[null,"Email Sekolah",":","sdninja@konohagaku.re",null,null,"BPU08"]
[null,null,null,null,null,null,"BPU09"]
[null,null,null,null,null,null,"BPU10"]
[null,null,null,null,null,null,"BPU11"]
[null,null,null,null,null,null,"BPU12"]
{"$rows_left_out":489}
{"sheet":"DATA KAS","index":2,"n_rows":500,"n_cols":18,"rows_kept":500,"cut":false,"hidden":false,"merged":[]}
[]
[null,null,"TANGGAL","KODE KEGIATAN","KODE REKENING","URAIAN","UNTUK PEMBAYARAN (KETERANGAN DI NOTA)","NO. BUKTI","VOLUME","SATUAN","HARGA","PENGELUARAN","TEMPAT PEMBAYARAN","KODE LAMPIRAN","Pilih Nama Toko (jika ada)","Nomor","Alamat","Tanggal"]
[{"$f":"H3","v":0},{"$f":"H3&\" \"&COUNTIFS($H$3:H3,H3)","v":" 0"},"2024-04-01",null,null,"Saldo Tunai Bulan Maret 2024",null,null,{"$f":"IF(K3=\"\",\"\",L3/K3)","v":""},null,null,0,null,null,null,{"$f":"IFERROR(VLOOKUP(O3,DAFTAR_TOKO,2,FALSE),\"\")","v":""},{"$f":"IFERROR(VLOOKUP(O3,DAFTAR_TOKO,3,FALSE),\"\")","v":""},{"$f":"IF(C3=\"\",\"\",C3)","v":"2024-04-01"}]
[{"$f":"H4","v":0},{"$f":"H4&\" \"&COUNTIFS($H$3:H4,H4)","v":" 0"},"2024-04-01",null,null,"Tarik Tunai",null,null,{"$f":"IF(K4=\"\",\"\",L4/K4)","v":""},null,null,0,null,null,null,"","",{"$f":"IF(C4=\"\",\"\",C4)","v":"2024-04-01"}]
["BPU01",{"$f":"H5&\" \"&COUNTIFS($H$3:H5,H5)","v":"BPU01 1"},"2024-04-02","07.12.01.","5.1.02.02.01\n.0013","Tenten, S.Pd.",{"$f":"\"Pembayaran Honorarium Guru Honor Sekolah an. \"&F5&\" bulan Januari - April\"","v":"Pembayaran Honorarium Guru Honor Sekolah an. Tenten, S.Pd. bulan Januari - April"},"BPU01",1,"orang/bulan",{"$f":"L5","v":1100000},1100000,"Periji",null,null,"","","2024-04-02"]
["BPU01",{"$f":"H6&\" \"&COUNTIFS($H$3:H6,H6)","v":"BPU01 2"},"2024-04-02","07.12.01.","5.1.02.02.01\n.0013","Tenten, S.Pd.",{"$f":"\"Pembayaran Honorarium Guru Honor Sekolah an. \"&F6&\" bulan Januari - April\"","v":"Pembayaran Honorarium Guru Honor Sekolah an. Tenten, S.Pd. bulan Januari - April"},"BPU01",1,"orang/bulan",{"$f":"L6","v":1100000},1100000,"Periji",null,null,"","","2024-04-02"]
["BPU01",{"$f":"H7&\" \"&COUNTIFS($H$3:H7,H7)","v":"BPU01 3"},"2024-04-02","07.12.01.","5.1.02.02.01\n.0013","Tenten, S.Pd.","Pembayaran Honorarium Guru Honor Sekolah an. Tenten, S.Pd. bulan Januari - April","BPU01",1,"orang/bulan",1100000,1100000,"Periji",null,null,"","","2024-04-02"]
["BPU01",{"$f":"H8&\" \"&COUNTIFS($H$3:H8,H8)","v":"BPU01 4"},"2024-04-02","07.12.01.","5.1.02.02.01\n.0013","Tenten, S.Pd.","Pembayaran Honorarium Guru Honor Sekolah an. Tenten, S.Pd. bulan Januari - April","BPU01",1,"orang/bulan",1100000,1100000,"Periji",null,null,"","","2024-04-02"]
["BPU02",{"$f":"H9&\" \"&COUNTIFS($H$3:H9,H9)","v":"BPU02 1"},"2024-04-02","07.12.01.","5.1.02.02.01\n.0013","Sakura, S.Pd.","Pembayaran Honorarium Guru Honor Sekolah an. Sakura, S.Pd. bulan Januari - April","BPU02",1,"orang/bulan",1100000,1100000,"Periji",null,null,"","","2024-04-02"]
["BPU02",{"$f":"H10&\" \"&COUNTIFS($H$3:H10,H10)","v":"BPU02 2"},"2024-04-02","07.12.01.","5.1.02.02.01\n.0013","Sakura, S.Pd.","Pembayaran Honorarium Guru Honor Sekolah an. Sakura, S.Pd. bulan Januari - April","BPU02",1,"orang/bulan",1100000,1100000,"Periji",null,null,"","","2024-04-02"]
["BPU02",{"$f":"H11&\" \"&COUNTIFS($H$3:H11,H11)","v":"BPU02 3"},"2024-04-02","07.12.01.","5.1.02.02.01\n.0013","Sakura, S.Pd.","Pembayaran Honorarium Guru Honor Sekolah an. Sakura, S.Pd. bulan Januari - April","BPU02",1,"orang/bulan",1100000,1100000,"Periji",null,null,"","","2024-04-02"]
["BPU02",{"$f":"H12&\" \"&COUNTIFS($H$3:H12,H12)","v":"BPU02 4"},"2024-04-02","07.12.01.","5.1.02.02.01\n.0013","Sakura, S.Pd.","Pembayaran Honorarium Guru Honor Sekolah an. Sakura, S.Pd. bulan Januari - April","BPU02",1,"orang/bulan",1100000,1100000,"Periji",null,null,"","","2024-04-02"]
["BPU03",{"$f":"H13&\" \"&COUNTIFS($H$3:H13,H13)","v":"BPU03 1"},"2024-04-02","07.12.01.","5.1.02.02.01\n.0013","Kiba, S.Pd.","Pembayaran Honorarium Guru Honor Sekolah an. Kiba, S.Pd. bulan Januari - April","BPU03",1,"orang/bulan",1000000,1000000,"Periji",null,null,"","","2024-04-02"]
["BPU03",{"$f":"H14&\" \"&COUNTIFS($H$3:H14,H14)","v":"BPU03 2"},"2024-04-02","07.12.01.","5.1.02.02.01\n.0013","Kiba, S.Pd.","Pembayaran Honorarium Guru Honor Sekolah an. Kiba, S.Pd. bulan Januari - April","BPU03",1,"orang/bulan",1000000,1000000,"Periji",null,null,"","","2024-04-02"]
["BPU03",{"$f":"H15&\" \"&COUNTIFS($H$3:H15,H15)","v":"BPU03 3"},"2024-04-02","07.12.01.","5.1.02.02.01\n.0013","Kiba, S.Pd.","Pembayaran Honorarium Guru Honor Sekolah an. Kiba, S.Pd. bulan Januari - April","BPU03",1,"orang/bulan",1000000,1000000,"Periji",null,null,"","","2024-04-02"]
{"$rows_left_out":486}
{"sheet":"DATA LAMPIRAN","index":3,"n_rows":491,"n_cols":14,"rows_kept":491,"cut":false,"hidden":false,"merged":[]}
[]
[null,"NAMA TRANSAKSI","Perihal Surat dan Nomor Surat Undangan","Kegiatan (berdasarkan surat undangan)","NAMA","NIP","JABATAN","DASAR SURAT UNDANGAN","LOKASI","TANGGAL KEGIATAN","VOLUME","SATUAN","HARGA","TOTAL"]
[null,1,2,3,4,5,6,7,8,9,10,8,11,12]
[{"$f":"IFERROR(B4&\" \"&COUNTIFS($B$4:B4,B4),\"\")","v":"Transport rapat rutin KKKS 29 Mei 1"},"Transport rapat rutin KKKS 29 Mei","surat undangan rapat Korwil Noyan nomor: 420/76/Korwil-B","Rapat Koordinasi KKKS","Temari, S.Pd.",{"$f":"IFERROR(VLOOKUP(E4,data_guru,3,FALSE),\"\")","v":"53-004"},"Guru",null,"Kantor Hokage","2024-05-29",{"$f":"IFERROR(VLOOKUP(B4,data_kas3,3,FALSE),\"\")","v":1},{"$f":"IFERROR(VLOOKUP(B4,data_kas3,4,FALSE),\"\")","v":"orang/kegiatan"},{"$f":"IFERROR(VLOOKUP(B4,data_kas3,5,FALSE),\"\")","v":200000},{"$f":"IF(K4=\"\",\"\",K4*M4)","v":200000}]
[{"$f":"IFERROR(B5&\" \"&COUNTIFS($B$4:B5,B5),\"\")","v":"Transport rapat rutin KKKS 1"},"Transport rapat rutin KKKS","surat undangan rapat Korwil Noyan nomor: 420/66/Korwil-08 tanggal 6 Mei 2024","Rapat Koordinasi KKKS","Tenten, S.Pd.",0,"Guru",null,"Kantor Hokage","2024-05-08",{"$f":"IFERROR(VLOOKUP(B5,data_kas3,3,FALSE),\"\")","v":1},"orang/kegiatan",200000,200000]
[{"$f":"IFERROR(B6&\" \"&COUNTIFS($B$4:B6,B6),\"\")","v":"Transport kegiatan Kombel KKG Gugus 2 Sungai Dangin bulan Januari 1"},"Transport kegiatan Kombel KKG Gugus 2 Sungai Dangin bulan Januari","surat undangan rapat Kombel Gugus II Sungai Dangin nomor 422/12/SD.07/I/2024 tanggal 18 Januari 2024","Undangan Rapat Kombel Gugus II Sungai Dangin","Shikamaru, S.Pd.","012611","Kepala Sekolah",null,"Kantor Ninja Konoha","2024-01-20",1,"orang/kegiatan",150000,{"$f":"M6*K6","v":150000}]
[{"$f":"IFERROR(B7&\" \"&COUNTIFS($B$4:B7,B7),\"\")","v":"Transport kegiatan Kombel KKG Gugus 2 Sungai Dangin bulan Januari 2"},"Transport kegiatan Kombel KKG Gugus 2 Sungai Dangin bulan Januari","surat undangan rapat Kombel Gugus II Sungai Dangin nomor 422/12/SD.07/I/2024 tanggal 18 Januari 2025","Undangan Rapat Kombel Gugus II Sungai Dangin","Shikamaru, S.Pd.","012611","Guru",null,"Kantor Ninja Konoha","2024-01-20",1,"orang/kegiatan",150000,{"$f":"M7*K7","v":150000}]
[{"$f":"IFERROR(B8&\" \"&COUNTIFS($B$4:B8,B8),\"\")","v":"Transport kegiatan Kombel KKG Gugus 2 Sungai Dangin bulan Januari 3"},"Transport kegiatan Kombel KKG Gugus 2 Sungai Dangin bulan Januari","surat undangan rapat Kombel Gugus II Sungai Dangin nomor 422/12/SD.07/I/2024 tanggal 18 Januari 2026","Undangan Rapat Kombel Gugus II Sungai Dangin","Temari, S.Pd.","53-004","Guru",null,"Kantor Ninja Konoha","2024-01-20",1,"orang/kegiatan",150000,150000]
[{"$f":"IFERROR(B9&\" \"&COUNTIFS($B$4:B9,B9),\"\")","v":"Transport kegiatan Kombel KKG Gugus 2 Sungai Dangin bulan Januari 4"},"Transport kegiatan Kombel KKG Gugus 2 Sungai Dangin bulan Januari","surat undangan rapat Kombel Gugus II Sungai Dangin nomor 422/12/SD.07/I/2024 tanggal 18 Januari 2027","Undangan Rapat Kombel Gugus II Sungai Dangin","Tenten, S.Pd.",0,"Guru",null,"Kantor Ninja Konoha","2024-01-20",1,"orang/kegiatan",150000,150000]
[{"$f":"IFERROR(B10&\" \"&COUNTIFS($B$4:B10,B10),\"\")","v":"Transport kegiatan Kombel KKG Gugus 2 Sungai Dangin bulan Januari 5"},"Transport kegiatan Kombel KKG Gugus 2 Sungai Dangin bulan Januari","surat undangan rapat Kombel Gugus II Sungai Dangin nomor 422/12/SD.07/I/2024 tanggal 18 Januari 2028","Undangan Rapat Kombel Gugus II Sungai Dangin","Sakura, S.Pd.",0,"Guru",null,"Kantor Ninja Konoha","2024-01-20",1,"orang/kegiatan",150000,150000]
[{"$f":"IFERROR(B11&\" \"&COUNTIFS($B$4:B11,B11),\"\")","v":"Transport kegiatan Kombel KKG Gugus 2 Sungai Dangin bulan Januari 6"},"Transport kegiatan Kombel KKG Gugus 2 Sungai Dangin bulan Januari","surat undangan rapat Kombel Gugus II Sungai Dangin nomor 422/12/SD.07/I/2024 tanggal 18 Januari 2029","Undangan Rapat Kombel Gugus II Sungai Dangin","Kiba, S.Pd.",0,"Guru",null,"Kantor Ninja Konoha","2024-01-20",1,"orang/kegiatan",150000,150000]
[{"$f":"IFERROR(B12&\" \"&COUNTIFS($B$4:B12,B12),\"\")","v":"Transport kegiatan Kombel KKG Gugus 2 Sungai Dangin bulan Januari 7"},"Transport kegiatan Kombel KKG Gugus 2 Sungai Dangin bulan Januari","surat undangan rapat Kombel Gugus II Sungai Dangin nomor 422/12/SD.07/I/2024 tanggal 18 Januari 2030","Undangan Rapat Kombel Gugus II Sungai Dangin","Tenten, S.Pd.",0,"Guru",null,"Kantor Ninja Konoha","2024-01-20",1,"orang/kegiatan",150000,150000]
[{"$f":"IFERROR(B13&\" \"&COUNTIFS($B$4:B13,B13),\"\")","v":" 0"},null,null,null,null,"",null,null,null,{"$f":"IFERROR(VLOOKUP(B13,data_kas3,12,FALSE),\"\")","v":""},1,"","",{"$error":"#VALUE!"}]
[{"$f":"IFERROR(B14&\" \"&COUNTIFS($B$4:B14,B14),\"\")","v":" 0"},null,null,null,null,"",null,null,null,"",1,"","",{"$error":"#VALUE!"}]
[{"$f":"IFERROR(B15&\" \"&COUNTIFS($B$4:B15,B15),\"\")","v":" 0"},null,null,null,null,"",null,null,null,"",1,"","",{"$error":"#VALUE!"}]
{"$rows_left_out":477}
{"sheet":"KUITANSI UMUM","index":4,"n_rows":56,"n_cols":25,"rows_kept":56,"cut":false,"hidden":false,"merged":[[1,4,4,10],[1,13,1,18],[2,13,2,18],[3,13,3,18],[4,13,4,18],[47,11,47,13],[9,7,9,18],[45,7,45,9],[48,5,48,8],[10,7,10,18],[48,16,48,18],[46,4,46,18],[49,15,49,16],[55,5,55,8],[49,10,49,12],[49,5,49,8],[54,5,54,8],[54,10,54,13],[55,10,55,13]]}
[]
[null,null,null,null,"KUITANSI PEMBAYARAN",null,null,null,null,null,null,"Nomor",null,{"$f":"V10&\"/BOSP/\"&'DATA UMUM'!D9","v":"BPU05/BOSP/2024"},null,null,null,null,null,null,"Pilih BPU dengan tombol panah, klik tombol PROSES"]
[null,null,null,null,null,null,null,null,null,null,null,"Tahun Anggaran",null,{"$f":"'DATA UMUM'!D9","v":2024},null,null,null,null,null,null,"Selalu klik tombol PROSES sebelum print"]
[null,null,null,null,null,null,null,null,null,null,null,"Kode Kegiatan",null,{"$f":"IFERROR(VLOOKUP(V10,DATA_KAS,4,FALSE),\"\")","v":"06.05.08."},null,null,null,null,null,null,"Nomor BPU bisa diketik manual, untuk mencari BPU"]
[null,null,null,null,null,null,null,null,null,null,null,"Kode Rekening",null,{"$f":"IFERROR(VLOOKUP(V10,DATA_KAS,5,FALSE),\"\")","v":"5.1.02.01.01\n.0024"}]
[null,{"$f":"IF(E6=0,0,1)","v":1},null,null,{"$f":"IFERROR(VLOOKUP(V10,DATA_KAS,15,FALSE),0)","v":"Toko Senjata Tenten"}]
[null,{"$f":"IF(E7=\"\",0,1)","v":1},null,null,{"$f":"IFERROR(VLOOKUP(V10,DATA_KAS,17,FALSE),0)","v":"Jalan Ninja Nomor 2, Desa Konohagakure, Negara Api"}]
[null,{"$f":"IF(E8=\"\",0,1)","v":1},null,null,{"$f":"IFERROR(VLOOKUP(V10,DATA_KAS,16,FALSE),0)","v":"005003"}]
[null,1,null,null,"Sudah diterima dari",null,null,{"$f":"\"Kepala \"&'DATA UMUM'!D2","v":"Kepala SD Ninja 01 Konoha"},null,null,null,null,null,null,null,null,null,null,null,null,"NO","NO. BUKTI",null,null,{"$f":"IFERROR(VLOOKUP(V10,DATA_KAS,14,FALSE),\"\")","v":0}]
[null,1,null,null,"Uang sejumlah",null,null,{"$f":"IFERROR(PROPER(IF( H46=0,\"nol\",IF( H46<0,\"minus \",\"\")&SUBSTITUTE(TRIM(SUBSTITUTE(SUBSTITUTE(SUBSTITUTE(SUBSTITUTE(SUBSTITUTE(SUBSTITUTE(SUBSTITUTE(SUBSTITUTE(SUBSTITUTE(SUBSTITUTE(SUBSTITUTE(SUBSTITUTE(SUBSTITUTE(SUBSTITUTE(SUBSTITUTE(SUBSTITUTE(SUBSTITUTE(SUBSTITUTE(SUBSTITUTE(SUBSTITUTE(SUBSTITUTE(SUBSTITUTE(SUBSTITUTE(SUBSTITUTE(IF(--MID(TEXT(ABS( H46),\"000000000000000\"),1,3)=0,\"\",MID(TEXT(ABS( H46),\"000000000000000\"),1,1)&\" ratus \"&MID(TEXT(ABS( H46),\"000000000000000\"),2,1)&\" puluh \"&MID(TEXT(ABS( H46),\"000000000000000\"),3,1)&\" trilyun \")&IF(--MID(TEXT(ABS( H46),\"000000000000000\"),4,3)=0,\"\",MID(TEXT(ABS( H46),\"000000000000000\"),4,1)&\" ratus \"&MID(TEXT(ABS( H46),\"000000000000000\"),5,1)&\" puluh \"&MID(TEXT(ABS( H46),\"000000000000000\"),6,1)&\" milyar \")&IF(--MID(TEXT(ABS( H46),\"000000000000000\"),7,3)=0,\"\",MID(TEXT(ABS( H46),\"000000000000000\"),7,1)&\" ratus \"&MID(TEXT(ABS( H46),\"000000000000000\"),8,1)&\" puluh \"&MID(TEXT(ABS( H46),\"000000000000000\"),9,1)&\" juta \")&IF(--MID(TEXT(ABS( H46),\"000000000000000\"),10,3)=0,\"\",IF(--MID(TEXT(ABS( H46),\"000000000000000\"),10,3)=1,\"*\",MID(TEXT(ABS( H46),\"000000000000000\"),10,1)&\" ratus \"&MID(TEXT(ABS( H46),\"000000000000000\"),11,1)&\" puluh \")&MID(TEXT(ABS( H46),\"000000000000000\"),12,1)&\" ribu \")&IF(--MID(TEXT(ABS( H46),\"000000000000000\"),13,3)=0,\"\",MID(TEXT(ABS( H46),\"000000000000000\"),13,1)&\" ratus \"&MID(TEXT(ABS( H46),\"000000000000000\"),14,1)&\" puluh \"&MID(TEXT(ABS( H46),\"000000000000000\"),15,1)),1,\"satu\"),2,\"dua\"),3,\"tiga\"),4,\"empat\"),5,\"lima\"),6,\"enam\"),7,\"tujuh\"),8,\"delapan\"),9,\"sembilan\"),\"0 ratus\",\"\"),\"0 puluh\",\"\"),\"satu puluh 0\",\"sepuluh\"),\"satu puluh satu\",\"sebelas\"),\"satu puluh dua\",\"duabelas\"),\"satu puluh tiga\",\"tigabelas\"),\"satu puluh empat\",\"empatbelas\"),\"satu puluh lima\",\"limabelas\"),\"satu puluh enam\",\"enambelas\"),\"satu puluh tujuh\",\"tujuhbelas\"),\"satu puluh delapan\",\"delapanbelas\"),\"satu puluh sembilan\",\"sembilanbelas\"),\"satu ratus\",\"seratus\"),\"*satu ribu\",\"seribu\"),0,\"\")),\" \",\" \")))&\" \" &\"Rupiah\",\"\")","v":"Satu Juta Sembilan Ratus Delapan Puluh Delapan Ribu Rupiah"},null,null,null,null,null,null,null,null,null,null,null,null,5,{"$f":"\"BPU\"&TEXT(U10,\"00\")","v":"BPU05"}]
[null,1,null,null,"Untuk pembayaran",null,null,{"$f":"IFERROR(VLOOKUP(V10,DATA_KAS,7,FALSE),\"\")","v":"Pembelian ATK"}]
[null,0,null,null,null,null,null,{"$f":"IF(Y9=2,\"Dengan rincian sebagai berikut:\",IF(Y9=1,\"(daftar terlampir)\",\"\"))","v":""}]
[{"$f":"$V$10&\" \"&D13","v":"BPU05 1"},0,{"$f":"D13","v":1},1,null,null,{"$f":"IFERROR(IF(Q13<>\"\",COUNTA($Q13:Q$13),\"\"),\"\")","v":1},{"$f":"IFERROR(VLOOKUP(A13,DATA_ITEM,5,FALSE),\"\")","v":"Penghapus Whiteboard besar GM"},null,null,null,null,":",{"$f":"IFERROR(VLOOKUP(A13,DATA_ITEM,8,FALSE),\"\")","v":12},{"$f":"IFERROR(VLOOKUP(A13,DATA_ITEM,9,FALSE),\"\")","v":"pcs"},"@",{"$f":"IFERROR(VLOOKUP(A13,DATA_ITEM,10,FALSE),\"\")","v":16500},"=",{"$f":"IFERROR(VLOOKUP(A13,DATA_ITEM,11,FALSE),\"\")","v":198000}]
[{"$f":"$V$10&\" \"&D14","v":"BPU05 2"},0,{"$f":"D14","v":2},2,null,null,{"$f":"IFERROR(IF(H14<>\"\",COUNTA($H$13:H14),\"\"),\"\")","v":2},"Kertas HVS Folio",null,null,null,null,":",10,{"$f":"IFERROR(VLOOKUP(A14,DATA_ITEM,9,FALSE),\"\")","v":"rim"},"@",90000,"=",900000]
["BPU05 3",0,3,3,null,null,{"$f":"IFERROR(IF(H15<>\"\",COUNTA($H$13:H15),\"\"),\"\")","v":3},"Catridge Printer IP 2770 810 Hitam- IP 2770 810 Hitam",null,null,null,null,":",1,{"$f":"IFERROR(VLOOKUP(A15,DATA_ITEM,9,FALSE),\"\")","v":"unit"},"@",300000,"=",300000]
{"$rows_left_out":42}
{"sheet":"SPMB","index":5,"n_rows":63,"n_cols":29,"rows_kept":63,"cut":false,"hidden":false,"merged":[[54,10,54,11],[59,10,59,12],[60,10,60,12],[49,6,49,14],[53,14,53,15],[7,4,7,15],[8,4,8,15],[15,4,15,15],[10,4,10,15],[1,4,1,15],[2,4,2,15],[3,4,3,15],[4,4,4,15],[5,4,5,15],[6,4,6,15]]}
[]
[null,null,null,null,"PEMERINTAH NEGARA API",null,null,null,null,null,null,null,null,null,null,null,null,"Pilih BPU dengan tombol panah, klik tombol PROSES"]
[null,null,null,null,"DINAS KENINJAAN",null,null,null,null,null,null,null,null,null,null,null,null,"Selalu klik tombol PROSES sebelum print"]
[null,null,null,null,"KOORDINATOR WILAYAH KONOHAGAKURE",null,null,null,null,null,null,null,null,null,null,null,null,"Nomor BPU bisa diketik manual, untuk mencari BPU"]
[null,null,null,null,{"$f":"UPPER('DATA UMUM'!D2)","v":"SD NINJA 01 KONOHA"}]
[null,{"$f":"IF(E6=0,0,1)","v":1},null,null,{"$f":"'DATA UMUM'!D10&\". NPSN: 30102196\"","v":"Desa Konohagakure, Negara Api. 666. NPSN: 30102196"}]
[null,{"$f":"IF(E7=\"\",0,1)","v":1},null,null,{"$f":"'DATA UMUM'!D11","v":"sdninja@konohagaku.re"}]
[null,{"$f":"IF(E8=\"\",0,1)","v":1},null,null,"SURAT PERINTAH MEMBELI BARANG"]
[null,1,null,null,"Nomor: 422/….../SD.17/Adm/2024",null,null,null,null,null,null,null,null,null,null,null,null,"NO","NO. BUKTI",null,null,{"$f":"IFERROR(VLOOKUP(S10,DATA_KAS,14,FALSE),\"\")","v":0}]
[null,1,null,null,null,null,null,null,null,null,null,null,null,null,null,null,null,5,{"$f":"\"BPU\"&TEXT(R10,\"00\")","v":"BPU05"}]
[null,1,null,null,"Yang bertandatangan di bawah ini kepala sekolah SD Negeri 17 Sungai Merah menugaskan:"]
[null,1,null,null,"nama",":",{"$f":"'DATA UMUM'!D6","v":"Temari, S.Pd."}]
[null,1,null,null,"NIP",":",{"$f":"'DATA UMUM'!D7","v":"53-004"}]
[null,1,null,null,"jabatan",":","Bendahara BOSP",null,null,null,null,null,null,null,null,null,null,null,null,null,null,null,null,null,null,null,null,null,{"$f":"240/2","v":120}]
[null,1,null,null,"unit kerja",":",{"$f":"'DATA UMUM'!D2","v":"SD Ninja 01 Konoha"}]
{"$rows_left_out":49}
{"sheet":"SP. Tugas","index":6,"n_rows":50,"n_cols":10,"rows_kept":50,"cut":false,"hidden":false,"merged":[[1,8,1,11],[0,8,0,11],[2,3,2,11],[7,3,7,11],[3,3,3,11],[4,3,4,11],[5,3,5,11],[6,3,6,11],[12,14,13,17],[11,14,11,17],[8,14,8,15],[46,4,46,5],[12,13,13,13],[45,4,45,5],[45,8,45,10],[12,3,12,11],[13,3,13,11],[36,4,36,11],[38,3,38,11],[9,3,9,11],[10,3,10,11],[40,9,40,11]]}
[null,null,null,null,null,null,null,"NOMOR BUKTI","KEGIATAN"]
["kjk",null,null,null,null,null,null,{"$f":"IFERROR(INDEX(NO_BUKTI,MATCH(I2,URAIAN,0)),\"\")","v":"BPU07"},"Transport kegiatan Kombel KKG Gugus 2 Sungai Dangin bulan Januari"]
[null,null,null,"PEMERINTAH NEGARA API"]
[null,null,null,"DINAS KENINJAAN"]
[null,null,null,"KOORDINATOR WILAYAH KONOHAGAKURE"]
[null,null,null,{"$f":"UPPER('DATA UMUM'!D2)","v":"SD NINJA 01 KONOHA"}]
[null,null,null,{"$f":"'DATA UMUM'!D10","v":"Desa Konohagakure, Negara Api. 666"}]
[null,null,null,{"$f":"\"email: \"&'DATA UMUM'!D11","v":"email: sdninja@konohagaku.re"}]
[]
[null,null,null,"SURAT PERINTAH TUGAS"]
[null,null,null,"Nomor: 422/….../SD.17/Adm/2024"]
[]
[null,null,null,{"$f":"\"Berdasarkan \"&IFERROR(VLOOKUP(I2,data_lampiran2,2,FALSE),\"PERLU DIISI\"&\"\")&\", maka yang bertandatangan di bawah ini Kepala Sekolah \"&'DATA UMUM'!D2","v":"Berdasarkan surat undangan rapat Kombel Gugus II Sungai Dangin nomor 422/12/SD.07/I/2024 tanggal 18 Januari 2024, maka yang bertandatangan di bawah ini Kepala Sekolah SD Ninja 01 Konoha"}]
[null,null,null,"MENUGASKAN"]
[null,1,null,"Kepada:","No","Nama","NIP","Jabatan"]
{"$rows_left_out":36}
{"sheet":"Daftar Penerima","index":7,"n_rows":44,"n_cols":13,"rows_kept":44,"cut":false,"hidden":false,"merged":[[34,11,34,13],[9,3,9,13],[10,3,10,13],[1,9,1,11],[0,9,0,11],[9,16,9,19],[10,15,11,15],[10,16,11,19],[11,3,11,13],[2,3,2,13],[3,3,3,13],[4,3,4,13],[5,3,5,13],[6,3,6,13],[7,3,7,13]]}
[null,null,null,null,null,null,null,null,"NO BUKTI","KEGIATAN"]
["kjk",null,null,null,null,null,null,null,{"$f":"IFERROR(INDEX(NO_BUKTI,MATCH(J2,URAIAN,0)),\"\")","v":"BPU07"},"Transport kegiatan Kombel KKG Gugus 2 Sungai Dangin bulan Januari"]
[null,null,null,"PEMERINTAH NEGARA API"]
[null,null,null,"DINAS KENINJAAN"]
[null,null,null,"KOORDINATOR WILAYAH KONOHAGAKURE"]
[null,null,null,{"$f":"UPPER('DATA UMUM'!D2)","v":"SD NINJA 01 KONOHA"}]
[null,null,null,{"$f":"'DATA UMUM'!D10","v":"Desa Konohagakure, Negara Api. 666"}]
[null,null,null,{"$f":"\"email: \"&'DATA UMUM'!D11","v":"email: sdninja@konohagaku.re"}]
[null,null,null,null,null,null,null,null,null,null,null,"Nomor",{"$f":"\": \"&I2&\"/\"&\"BOSP/\"&'DATA UMUM'!D9","v":": BPU07/BOSP/2024"}]
[null,null,null,"DAFTAR PENERIMA"]
[null,null,null,{"$f":"J2","v":"Transport kegiatan Kombel KKG Gugus 2 Sungai Dangin bulan Januari"}]
[]
[null,1,null,"No","Nama","NIP","Jabatan","Volume","Satuan","Harga","Jumlah","Tanda tangan"]
[null,{"$f":"IF(E14:E14<>\"\",1,0)","v":1},{"$f":"$J$2&\" \"&L14","v":"Transport kegiatan Kombel KKG Gugus 2 Sungai Dangin bulan Januari 1"},1,{"$f":"IFERROR(VLOOKUP(C14,data_lampiran3,5,FALSE),\"\")","v":"Shikamaru, S.Pd."},{"$f":"IFERROR(VLOOKUP(C14,data_lampiran3,6,FALSE),\"\")","v":"012611"},{"$f":"IFERROR(VLOOKUP(C14,data_lampiran3,7,FALSE),\"ISI DULU DATANYA\")","v":"Kepala Sekolah"},{"$f":"IFERROR(VLOOKUP(C14,data_lampiran3,11,FALSE),\"\")","v":1},{"$f":"IFERROR(VLOOKUP(C14,data_lampiran3,12,FALSE),\"\")","v":"orang/kegiatan"},{"$f":"IFERROR(VLOOKUP(C14,data_lampiran3,13,FALSE),\"\")","v":150000},{"$f":"IFERROR(VLOOKUP(C14,data_lampiran3,14,FALSE),\"\")","v":150000},1]
[null,{"$f":"IF(E15:E15<>\"\",1,0)","v":1},{"$f":"$J$2&\" \"&L15","v":"Transport kegiatan Kombel KKG Gugus 2 Sungai Dangin bulan Januari 2"},2,{"$f":"IFERROR(VLOOKUP(C15,data_lampiran3,5,FALSE),\"\")","v":"Shikamaru, S.Pd."},"012611",{"$f":"IFERROR(VLOOKUP(C15,data_lampiran3,7,FALSE),\"\")","v":"Guru"},1,"orang/kegiatan",150000,150000,2]
{"$rows_left_out":30}
{"sheet":"L. UPAH KERJA","index":8,"n_rows":24,"n_cols":14,"rows_kept":24,"cut":false,"hidden":false,"merged":[[0,0,0,11],[11,0,11,9],[16,1,16,3],[5,3,5,7],[5,0,7,0],[5,1,7,1],[5,2,7,2],[5,8,7,8],[5,9,7,9],[5,10,7,10],[5,11,7,11],[16,8,16,11],[22,1,22,3],[23,1,23,3],[17,8,17,10],[22,8,22,10],[23,8,23,10],[17,1,17,3]]}
["DAFTAR HADIR DAN PENERIMAAN UPAH KERJA"]
[]
["PEKERJAAN",null,": Menebas rumput lapangan sekolah",null,null,null,null,null,null,null,null,null,null,"CAPEK DEHH"]
["LOKASI",null,{"$f":"\": \"&'DATA UMUM'!D2","v":": SD Ninja 01 Konoha"},null,null,null,null,null,null,null,null,null,null,"YG INI MANUAL AJA YA :)"]
[]
["NO","NAMA","PROFESI","HARI KERJA",null,null,null,null,"JUMLAH HARI KERJA","HARGA SATUAN","JUMLAH YANG DITERIMA","TANDA TANGAN"]
[null,null,null,"SENIN","SELASA","RABU","KAMIS","JUMAT"]
[]
[1,"Kiba","Honor",null,"2024-01-09","2024-01-10","2024-01-11","2024-01-12",4,100000,{"$f":"I9*J9","v":400000}]
[2,"Choji","Honor",null,null,null,"2024-01-11","2024-01-12",2,100000,{"$f":"I10*J10","v":200000}]
[]
["JUMLAH",null,null,null,null,null,null,null,null,null,{"$f":"SUM(K9:K10)","v":600000}]
[]
[]
[]
{"$rows_left_out":10}
{"sheet":"L. Rapat","index":9,"n_rows":33,"n_cols":6,"rows_kept":33,"cut":false,"hidden":false,"merged":[[20,3,20,4],[12,5,12,6],[13,5,13,6],[14,5,14,6],[15,5,15,6],[16,5,16,6],[17,5,17,6],[18,5,18,6],[19,5,19,6],[20,5,20,6],[20,1,20,2],[18,1,18,2],[12,3,12,4],[13,3,13,4],[14,3,14,4],[15,3,15,4],[16,3,16,4],[17,3,17,4],[18,3,18,4],[19,3,19,4],[13,1,13,2],[14,1,14,2],[15,1,15,2],[16,1,16,2],[17,1,17,2],[19,1,19,2],[12,1,12,2],[0,0,0,8],[1,0,1,8],[2,0,2,8],[3,0,3,8],[4,0,4,8],[5,0,5,8],[7,0,7,8]]}
["PEMERINTAH NEGARA API"]
["DINAS KENINJAAN"]
["KOORDINATOR WILAYAH KONOHAGAKURE"]
[{"$f":"UPPER('DATA UMUM'!D2)","v":"SD NINJA 01 KONOHA"}]
[{"$f":"\"Alamat: \"&'DATA UMUM'!D10","v":"Alamat: Desa Konohagakure, Negara Api. 666"}]
[{"$f":"\"email: \"&'DATA UMUM'!D11","v":"email: sdninja@konohagaku.re"}]
[]
["DAFTAR HADIR"]
[]
["Hari/tanggal",null,":"]
["Kegiatan",null,":"]
[]
["No","Nama",null,"Jabatan",null,"Tanda tangan"]
[1,{"$f":"'DATA UMUM'!B17","v":"Shikamaru, S.Pd."},null,"Kepala Sekolah",null,1]
[2,{"$f":"'DATA UMUM'!B18","v":"Temari, S.Pd."},null,"Guru Kelas",null,2]
{"$rows_left_out":18}