{"text_format":"1","workbook":"xlsx","n_sheets":10,"sheets":["Home","DATA UMUM","DATA KAS","DATA LAMPIRAN","KUITANSI UMUM","SPMB","SP. Tugas","Daftar Penerima","L. UPAH KERJA","L. Rapat"],"not_rendered":{"charts":0,"images":3,"macros":1,"external_links":0,"defined_names":27,"comments":2,"pivot_tables":0},"unopened":[],"bounds":{"document_bytes":16777216,"sheet_cells":100000,"rows_first":2000,"rows_last":500,"rows_between":2000,"halvings":0,"cell_chars":16384,"cell_head_chars":4096},"cells_cut":0,"cells_raw":0,"read":"whole","date_system":"1900"}

{"sheet":"Home","index":0,"n_rows":20,"n_cols":2,"rows_kept":20,"cut":false,"hidden":false,"merged":[[15,1,15,10],[16,1,16,10],[14,1,14,10]]}
[]
[]
[]
[]
[]
[]
[]
[]
[]
[]
[]
[]
[]
[]
[null,"Dibuat oleh Aris Pratama, S.Pd."]
[null,"APLIKASI INI FREE UNTUK MEMBANTU BENDAHARA (OPERATOR ARKAS) MENGERJAKAN KUITANSI"]
[null,"DILARANG DIPERJUALBELIKAN!!!"]
[null,"NOTES:"]
[null,"Jika ada kendala boleh hubungi saya di WA/Telegram 082280097805"]
[null,"Jika ingin traktir saya secangkir kopi, boleh ke DANA 082280097805 😊"]

{"sheet":"DATA UMUM","index":1,"n_rows":503,"n_cols":11,"rows_kept":503,"cut":false,"hidden":false,"merged":[]}
[]
[null,"NAMA SEKOLAH",":","SD Ninja 01 Konoha",null,null,"BPU01",null,"Nama Toko","Nomor Telepon/HP","Alamat"]
[null,"TEMPAT (UTK TANGGAL NOTA)",":","Sungai Merah"]
[null,"NAMA KEPALA SEKOLAH",":","Shikamaru, S.Pd.",null,null,"BPU02",null,"Toko Senjata Tenten","005003","Jalan Ninja Nomor 2, Desa Konohagakure, Negara Api"]
[null,"NIP KEPALA SEKOLAH",":","012611",null,null,"BPU03",null,"Toko Percetakan Choji","006000","Jalan Ninja Nomor 2, Desa Konohagakure, Negara Api"]
[null,"NAMA BENDAHARA",":","Temari, S.Pd.",null,null,"BPU04",null,"Ichiraku Ramen","009000","Jalan Ninja Nomor 1, Desa Konohagakure, Negara Api"]
[null,"NIP BENDAHARA",":","53-004",null,null,"BPU05",null,"Toko Hyuga","002002","Jalan Ninja Nomor 3, Desa Konohagakure, Negara Api"]
[null,"SUMBER DANA",":","BOSP Tahap I"]
[null,"TAHUN",":",2024,null,null,"BPU06"]
[null,"Alamat Sekolah",":","Desa Konohagakure, Negara Api. 666",null,null,"BPU07"]
[null,"Email Sekolah",":","sdninja@konohagaku.re",null,null,"BPU08"]
[null,null,null,null,null,null,"BPU09"]
[null,null,null,null,null,null,"BPU10"]
[null,null,null,null,null,null,"BPU11"]
[null,null,null,null,null,null,"BPU12"]
[null,"Nama guru",null,"NIP",null,null,"BPU13"]
[null,{"$f":"D4","v":"Shikamaru, S.Pd."},null,{"$f":"D5","v":"012611"},null,null,"BPU14"]
[null,{"$f":"D6","v":"Temari, S.Pd."},null,{"$f":"D7","v":"53-004"},null,null,"BPU15"]
[null,"Tenten, S.Pd.",null,null,null,null,"BPU16"]
[null,"Sakura, S.Pd.",null,null,null,null,"BPU17"]
[null,"Kiba, S.Pd.",null,null,null,null,"BPU18"]
[null,null,null,null,null,null,"BPU19"]
[null,null,null,null,null,null,"BPU20"]
[null,null,null,null,null,null,"BPU21"]
[null,null,null,null,null,null,"BPU22"]
[null,null,null,null,null,null,"BPU23"]
[null,null,null,null,null,null,"BPU24"]
[null,null,null,null,null,null,"BPU25"]
[null,null,null,null,null,null,"BPU26"]
[null,null,null,null,null,null,"BPU27"]
[null,null,null,null,null,null,"BPU28"]
[null,null,null,null,null,null,"BPU29"]
[null,null,null,null,null,null,"BPU30"]
[null,null,null,null,null,null,"BPU31"]
[null,null,null,null,null,null,"BPU32"]
[null,null,null,null,null,null,"BPU33"]
[null,null,null,null,null,null,"BPU34"]
[null,null,null,null,null,null,"BPU35"]
[null,null,null,null,null,null,"BPU36"]
[null,null,null,null,null,null,"BPU37"]
[null,null,null,null,null,null,"BPU38"]
[null,null,null,null,null,null,"BPU39"]
[null,null,null,null,null,null,"BPU40"]
[null,"end",null,"end",null,null,"BPU41"]
[null,null,null,null,null,null,"BPU42"]
[null,null,null,null,null,null,"BPU43"]
[null,null,null,null,null,null,"BPU44"]
[null,null,null,null,null,null,"BPU45"]
[null,null,null,null,null,null,"BPU46"]
[null,null,null,null,null,null,"BPU47"]
[null,null,null,null,null,null,"BPU48"]
[null,null,null,null,null,null,"BPU49"]
[null,null,null,null,null,null,"BPU50"]
[null,null,null,null,null,null,"BPU51"]
[null,null,null,null,null,null,"BPU52"]
[null,null,null,null,null,null,"BPU53"]
[null,null,null,null,null,null,"BPU54"]
[null,null,null,null,null,null,"BPU55"]
[null,null,null,null,null,null,"BPU56"]
[null,null,null,null,null,null,"BPU57"]
[null,null,null,null,null,null,"BPU58"]
[null,null,null,null,null,null,"BPU59"]
[null,null,null,null,null,null,"BPU60"]
[null,null,null,null,null,null,"BPU61"]
[null,null,null,null,null,null,"BPU62"]
[null,null,null,null,null,null,"BPU63"]
[null,null,null,null,null,null,"BPU64"]
[null,null,null,null,null,null,"BPU65"]
[null,null,null,null,null,null,"BPU66"]
[null,null,null,null,null,null,"BPU67"]
[null,null,null,null,null,null,"BPU68"]
[null,null,null,null,null,null,"BPU69"]
[null,null,null,null,null,null,"BPU70"]
[null,null,null,null,null,null,"BPU71"]
[null,null,null,null,null,null,"BPU72"]
[null,null,null,null,null,null,"BPU73"]
[null,null,null,null,null,null,"BPU74"]
[null,null,null,null,null,null,"BPU75"]
[null,null,null,null,null,null,"BPU76"]
[null,null,null,null,null,null,"BPU77"]
[null,null,null,null,null,null,"BPU78"]
[null,null,null,null,null,null,"BPU79"]
[null,null,null,null,null,null,"BPU80"]
[null,null,null,null,null,null,"BPU81"]
[null,null,null,null,null,null,"BPU82"]
[null,null,null,null,null,null,"BPU83"]
[null,null,null,null,null,null,"BPU84"]
[null,null,null,null,null,null,"BPU85"]
[null,null,null,null,null,null,"BPU86"]
[null,null,null,null,null,null,"BPU87"]
[null,null,null,null,null,null,"BPU88"]
[null,null,null,null,null,null,"BPU89"]
[null,null,null,null,null,null,"BPU90"]
[null,null,null,null,null,null,"BPU91"]
[null,null,null,null,null,null,"BPU92"]
[null,null,null,null,null,null,"BPU93"]
[null,null,null,null,null,null,"BPU94"]
[null,null,null,null,null,null,"BPU95"]
[null,null,null,null,null,null,"BPU96"]
[null,null,null,null,null,null,"BPU97"]
[null,null,null,null,null,null,"BPU98"]
[null,null,null,null,null,null,"BPU99"]
[null,null,null,null,null,null,"BPU100"]
[null,null,null,null,null,null,"BPU101"]
[null,null,null,null,null,null,"BPU102"]
[null,null,null,null,null,null,"BPU103"]
[null,null,null,null,null,null,"BPU104"]
[null,null,null,null,null,null,"BPU105"]
[null,null,null,null,null,null,"BPU106"]
[null,null,null,null,null,null,"BPU107"]
[null,null,null,null,null,null,"BPU108"]
[null,null,null,null,null,null,"BPU109"]
[null,null,null,null,null,null,"BPU110"]
[null,null,null,null,null,null,"BPU111"]
[null,null,null,null,null,null,"BPU112"]
[null,null,null,null,null,null,"BPU113"]
[null,null,null,null,null,null,"BPU114"]
[null,null,null,null,null,null,"BPU115"]
[null,null,null,null,null,null,"BPU116"]
[null,null,null,null,null,null,"BPU117"]
[null,null,null,null,null,null,"BPU118"]
[null,null,null,null,null,null,"BPU119"]
[null,null,null,null,null,null,"BPU120"]
[null,null,null,null,null,null,"BPU121"]
[null,null,null,null,null,null,"BPU122"]
[null,null,null,null,null,null,"BPU123"]
[null,null,null,null,null,null,"BPU124"]
[null,null,null,null,null,null,"BPU125"]
[null,null,null,null,null,null,"BPU126"]
[null,null,null,null,null,null,"BPU127"]
[null,null,null,null,null,null,"BPU128"]
[null,null,null,null,null,null,"BPU129"]
[null,null,null,null,null,null,"BPU130"]
[null,null,null,null,null,null,"BPU131"]
[null,null,null,null,null,null,"BPU132"]
[null,null,null,null,null,null,"BPU133"]
[null,null,null,null,null,null,"BPU134"]
[null,null,null,null,null,null,"BPU135"]
[null,null,null,null,null,null,"BPU136"]
[null,null,null,null,null,null,"BPU137"]
[null,null,null,null,null,null,"BPU138"]
[null,null,null,null,null,null,"BPU139"]
[null,null,null,null,null,null,"BPU140"]
[null,null,null,null,null,null,"BPU141"]
[null,null,null,null,null,null,"BPU142"]
[null,null,null,null,null,null,"BPU143"]
[null,null,null,null,null,null,"BPU144"]
[null,null,null,null,null,null,"BPU145"]
[null,null,null,null,null,null,"BPU146"]
[null,null,null,null,null,null,"BPU147"]
[null,null,null,null,null,null,"BPU148"]
[null,null,null,null,null,null,"BPU149"]
[null,null,null,null,null,null,"BPU150"]
[null,null,null,null,null,null,"BPU151"]
[null,null,null,null,null,null,"BPU152"]
[null,null,null,null,null,null,"BPU153"]
[null,null,null,null,null,null,"BPU154"]
[null,null,null,null,null,null,"BPU155"]
[null,null,null,null,null,null,"BPU156"]
[null,null,null,null,null,null,"BPU157"]
[null,null,null,null,null,null,"BPU158"]
[null,null,null,null,null,null,"BPU159"]
[null,null,null,null,null,null,"BPU160"]
[null,null,null,null,null,null,"BPU161"]
[null,null,null,null,null,null,"BPU162"]
[null,null,null,null,null,null,"BPU163"]
[null,null,null,null,null,null,"BPU164"]
[null,null,null,null,null,null,"BPU165"]
[null,null,null,null,null,null,"BPU166"]
[null,null,null,null,null,null,"BPU167"]
[null,null,null,null,null,null,"BPU168"]
[null,null,null,null,null,null,"BPU169"]
[null,null,null,null,null,null,"BPU170"]
[null,null,null,null,null,null,"BPU171"]
[null,null,null,null,null,null,"BPU172"]
[null,null,null,null,null,null,"BPU173"]
[null,null,null,null,null,null,"BPU174"]
[null,null,null,null,null,null,"BPU175"]
[null,null,null,null,null,null,"BPU176"]
[null,null,null,null,null,null,"BPU177"]
[null,null,null,null,null,null,"BPU178"]
[null,null,null,null,null,null,"BPU179"]
[null,null,null,null,null,null,"BPU180"]
[null,null,null,null,null,null,"BPU181"]
[null,null,null,null,null,null,"BPU182"]
[null,null,null,null,null,null,"BPU183"]
[null,null,null,null,null,null,"BPU184"]
[null,null,null,null,null,null,"BPU185"]
[null,null,null,null,null,null,"BPU186"]
[null,null,null,null,null,null,"BPU187"]
[null,null,null,null,null,null,"BPU188"]
[null,null,null,null,null,null,"BPU189"]
[null,null,null,null,null,null,"BPU190"]
[null,null,null,null,null,null,"BPU191"]
[null,null,null,null,null,null,"BPU192"]
[null,null,null,null,null,null,"BPU193"]
[null,null,null,null,null,null,"BPU194"]
[null,null,null,null,null,null,"BPU195"]
[null,null,null,null,null,null,"BPU196"]
[null,null,null,null,null,null,"BPU197"]
[null,null,null,null,null,null,"BPU198"]
[null,null,null,null,null,null,"BPU199"]
[null,null,null,null,null,null,"BPU200"]
[null,null,null,null,null,null,"BPU201"]
[null,null,null,null,null,null,"BPU202"]
[null,null,null,null,null,null,"BPU203"]
[null,null,null,null,null,null,"BPU204"]
[null,null,null,null,null,null,"BPU205"]
[null,null,null,null,null,null,"BPU206"]
[null,null,null,null,null,null,"BPU207"]
[null,null,null,null,null,null,"BPU208"]
[null,null,null,null,null,null,"BPU209"]
[null,null,null,null,null,null,"BPU210"]
[null,null,null,null,null,null,"BPU211"]
[null,null,null,null,null,null,"BPU212"]
[null,null,null,null,null,null,"BPU213"]
[null,null,null,null,null,null,"BPU214",null,"end","end","end"]
[null,null,null,null,null,null,"BPU215"]
[null,null,null,null,null,null,"BPU216"]
[null,null,null,null,null,null,"BPU217"]
[null,null,null,null,null,null,"BPU218"]
[null,null,null,null,null,null,"BPU219"]
[null,null,null,null,null,null,"BPU220"]
[null,null,null,null,null,null,"BPU221"]
[null,null,null,null,null,null,"BPU222"]
[null,null,null,null,null,null,"BPU223"]
[null,null,null,null,null,null,"BPU224"]
[null,null,null,null,null,null,"BPU225"]
[null,null,null,null,null,null,"BPU226"]
[null,null,null,null,null,null,"BPU227"]
[null,null,null,null,null,null,"BPU228"]
[null,null,null,null,null,null,"BPU229"]
[null,null,null,null,null,null,"BPU230"]
[null,null,null,null,null,null,"BPU231"]
[null,null,null,null,null,null,"BPU232"]
[null,null,null,null,null,null,"BPU233"]
[null,null,null,null,null,null,"BPU234"]
[null,null,null,null,null,null,"BPU235"]
[null,null,null,null,null,null,"BPU236"]
[null,null,null,null,null,null,"BPU237"]
[null,null,null,null,null,null,"BPU238"]
[null,null,null,null,null,null,"BPU239"]
[null,null,null,null,null,null,"BPU240"]
[null,null,null,null,null,null,"BPU241"]
[null,null,null,null,null,null,"BPU242"]
[null,null,null,null,null,null,"BPU243"]
[null,null,null,null,null,null,"BPU244"]
[null,null,null,null,null,null,"BPU245"]
[null,null,null,null,null,null,"BPU246"]
[null,null,null,null,null,null,"BPU247"]
[null,null,null,null,null,null,"BPU248"]
[null,null,null,null,null,null,"BPU249"]
[null,null,null,null,null,null,"BPU250"]
[null,null,null,null,null,null,"BPU251"]
[null,null,null,null,null,null,"BPU252"]
[null,null,null,null,null,null,"BPU253"]
[null,null,null,null,null,null,"BPU254"]
[null,null,null,null,null,null,"BPU255"]
[null,null,null,null,null,null,"BPU256"]
[null,null,null,null,null,null,"BPU257"]
[null,null,null,null,null,null,"BPU258"]
[null,null,null,null,null,null,"BPU259"]
[null,null,null,null,null,null,"BPU260"]
[null,null,null,null,null,null,"BPU261"]
[null,null,null,null,null,null,"BPU262"]
[null,null,null,null,null,null,"BPU263"]
[null,null,null,null,null,null,"BPU264"]
[null,null,null,null,null,null,"BPU265"]
[null,null,null,null,null,null,"BPU266"]
[null,null,null,null,null,null,"BPU267"]
[null,null,null,null,null,null,"BPU268"]
[null,null,null,null,null,null,"BPU269"]
[null,null,null,null,null,null,"BPU270"]
[null,null,null,null,null,null,"BPU271"]
[null,null,null,null,null,null,"BPU272"]
[null,null,null,null,null,null,"BPU273"]
[null,null,null,null,null,null,"BPU274"]
[null,null,null,null,null,null,"BPU275"]
[null,null,null,null,null,null,"BPU276"]
[null,null,null,null,null,null,"BPU277"]
[null,null,null,null,null,null,"BPU278"]
[null,null,null,null,null,null,"BPU279"]
[null,null,null,null,null,null,"BPU280"]
[null,null,null,null,null,null,"BPU281"]
[null,null,null,null,null,null,"BPU282"]
[null,null,null,null,null,null,"BPU283"]
[null,null,null,null,null,null,"BPU284"]
[null,null,null,null,null,null,"BPU285"]
[null,null,null,null,null,null,"BPU286"]
[null,null,null,null,null,null,"BPU287"]
[null,null,null,null,null,null,"BPU288"]
[null,null,null,null,null,null,"BPU289"]
[null,null,null,null,null,null,"BPU290"]
[null,null,null,null,null,null,"BPU291"]
[null,null,null,null,null,null,"BPU292"]
[null,null,null,null,null,null,"BPU293"]
[null,null,null,null,null,null,"BPU294"]
[null,null,null,null,null,null,"BPU295"]
[null,null,null,null,null,null,"BPU296"]
[null,null,null,null,null,null,"BPU297"]
[null,null,null,null,null,null,"BPU298"]
[null,null,null,null,null,null,"BPU299"]
[null,null,null,null,null,null,"BPU300"]
[null,null,null,null,null,null,"BPU301"]
[null,null,null,null,null,null,"BPU302"]
[null,null,null,null,null,null,"BPU303"]
[null,null,null,null,null,null,"BPU304"]
[null,null,null,null,null,null,"BPU305"]
[null,null,null,null,null,null,"BPU306"]
[null,null,null,null,null,null,"BPU307"]
[null,null,null,null,null,null,"BPU308"]
[null,null,null,null,null,null,"BPU309"]
[null,null,null,null,null,null,"BPU310"]
[null,null,null,null,null,null,"BPU311"]
[null,null,null,null,null,null,"BPU312"]
[null,null,null,null,null,null,"BPU313"]
[null,null,null,null,null,null,"BPU314"]
[null,null,null,null,null,null,"BPU315"]
[null,null,null,null,null,null,"BPU316"]
[null,null,null,null,null,null,"BPU317"]
[null,null,null,null,null,null,"BPU318"]
[null,null,null,null,null,null,"BPU319"]
[null,null,null,null,null,null,"BPU320"]
[null,null,null,null,null,null,"BPU321"]
[null,null,null,null,null,null,"BPU322"]
[null,null,null,null,null,null,"BPU323"]
[null,null,null,null,null,null,"BPU324"]
[null,null,null,null,null,null,"BPU325"]
[null,null,null,null,null,null,"BPU326"]
[null,null,null,null,null,null,"BPU327"]
[null,null,null,null,null,null,"BPU328"]
[null,null,null,null,null,null,"BPU329"]
[null,null,null,null,null,null,"BPU330"]
[null,null,null,null,null,null,"BPU331"]
[null,null,null,null,null,null,"BPU332"]
[null,null,null,null,null,null,"BPU333"]
[null,null,null,null,null,null,"BPU334"]
[null,null,null,null,null,null,"BPU335"]
[null,null,null,null,null,null,"BPU336"]
[null,null,null,null,null,null,"BPU337"]
[null,null,null,null,null,null,"BPU338"]
[null,null,null,null,null,null,"BPU339"]
[null,null,null,null,null,null,"BPU340"]
[null,null,null,null,null,null,"BPU341"]
[null,null,null,null,null,null,"BPU342"]
[null,null,null,null,null,null,"BPU343"]
[null,null,null,null,null,null,"BPU344"]
[null,null,null,null,null,null,"BPU345"]
[null,null,null,null,null,null,"BPU346"]
[null,null,null,null,null,null,"BPU347"]
[null,null,null,null,null,null,"BPU348"]
[null,null,null,null,null,null,"BPU349"]
[null,null,null,null,null,null,"BPU350"]
[null,null,null,null,null,null,"BPU351"]
[null,null,null,null,null,null,"BPU352"]
[null,null,null,null,null,null,"BPU353"]
[null,null,null,null,null,null,"BPU354"]
[null,null,null,null,null,null,"BPU355"]
[null,null,null,null,null,null,"BPU356"]
[null,null,null,null,null,null,"BPU357"]
[null,null,null,null,null,null,"BPU358"]
[null,null,null,null,null,null,"BPU359"]
[null,null,null,null,null,null,"BPU360"]
[null,null,null,null,null,null,"BPU361"]
[null,null,null,null,null,null,"BPU362"]
[null,null,null,null,null,null,"BPU363"]
[null,null,null,null,null,null,"BPU364"]
[null,null,null,null,null,null,"BPU365"]
[null,null,null,null,null,null,"BPU366"]
[null,null,null,null,null,null,"BPU367"]
[null,null,null,null,null,null,"BPU368"]
[null,null,null,null,null,null,"BPU369"]
[null,null,null,null,null,null,"BPU370"]
[null,null,null,null,null,null,"BPU371"]
[null,null,null,null,null,null,"BPU372"]
[null,null,null,null,null,null,"BPU373"]
[null,null,null,null,null,null,"BPU374"]
[null,null,null,null,null,null,"BPU375"]
[null,null,null,null,null,null,"BPU376"]
[null,null,null,null,null,null,"BPU377"]
[null,null,null,null,null,null,"BPU378"]
[null,null,null,null,null,null,"BPU379"]
[null,null,null,null,null,null,"BPU380"]
[null,null,null,null,null,null,"BPU381"]
[null,null,null,null,null,null,"BPU382"]
[null,null,null,null,null,null,"BPU383"]
[null,null,null,null,null,null,"BPU384"]
[null,null,null,null,null,null,"BPU385"]
[null,null,null,null,null,null,"BPU386"]
[null,null,null,null,null,null,"BPU387"]
[null,null,null,null,null,null,"BPU388"]
[null,null,null,null,null,null,"BPU389"]
[null,null,null,null,null,null,"BPU390"]
[null,null,null,null,null,null,"BPU391"]
[null,null,null,null,null,null,"BPU392"]
[null,null,null,null,null,null,"BPU393"]
[null,null,null,null,null,null,"BPU394"]
[null,null,null,null,null,null,"BPU395"]
[null,null,null,null,null,null,"BPU396"]
[null,null,null,null,null,null,"BPU397"]
[null,null,null,null,null,null,"BPU398"]
[null,null,null,null,null,null,"BPU399"]
[null,null,null,null,null,null,"BPU400"]
[null,null,null,null,null,null,"BPU401"]
[null,null,null,null,null,null,"BPU402"]
[null,null,null,null,null,null,"BPU403"]
[null,null,null,null,null,null,"BPU404"]
[null,null,null,null,null,null,"BPU405"]
[null,null,null,null,null,null,"BPU406"]
[null,null,null,null,null,null,"BPU407"]
[null,null,null,null,null,null,"BPU408"]
[null,null,null,null,null,null,"BPU409"]
[null,null,null,null,null,null,"BPU410"]
[null,null,null,null,null,null,"BPU411"]
[null,null,null,null,null,null,"BPU412"]
[null,null,null,null,null,null,"BPU413"]
[null,null,null,null,null,null,"BPU414"]
[null,null,null,null,null,null,"BPU415"]
[null,null,null,null,null,null,"BPU416"]
[null,null,null,null,null,null,"BPU417"]
[null,null,null,null,null,null,"BPU418"]
[null,null,null,null,null,null,"BPU419"]
[null,null,null,null,null,null,"BPU420"]
[null,null,null,null,null,null,"BPU421"]
[null,null,null,null,null,null,"BPU422"]
[null,null,null,null,null,null,"BPU423"]
[null,null,null,null,null,null,"BPU424"]
[null,null,null,null,null,null,"BPU425"]
[null,null,null,null,null,null,"BPU426"]
[null,null,null,null,null,null,"BPU427"]
[null,null,null,null,null,null,"BPU428"]
[null,null,null,null,null,null,"BPU429"]
[null,null,null,null,null,null,"BPU430"]
[null,null,null,null,null,null,"BPU431"]
[null,null,null,null,null,null,"BPU432"]
[null,null,null,null,null,null,"BPU433"]
[null,null,null,null,null,null,"BPU434"]
[null,null,null,null,null,null,"BPU435"]
[null,null,null,null,null,null,"BPU436"]
[null,null,null,null,null,null,"BPU437"]
[null,null,null,null,null,null,"BPU438"]
[null,null,null,null,null,null,"BPU439"]
[null,null,null,null,null,null,"BPU440"]
[null,null,null,null,null,null,"BPU441"]
[null,null,null,null,null,null,"BPU442"]
[null,null,null,null,null,null,"BPU443"]
[null,null,null,null,null,null,"BPU444"]
[null,null,null,null,null,null,"BPU445"]
[null,null,null,null,null,null,"BPU446"]
[null,null,null,null,null,null,"BPU447"]
[null,null,null,null,null,null,"BPU448"]
[null,null,null,null,null,null,"BPU449"]
[null,null,null,null,null,null,"BPU450"]
[null,null,null,null,null,null,"BPU451"]
[null,null,null,null,null,null,"BPU452"]
[null,null,null,null,null,null,"BPU453"]
[null,null,null,null,null,null,"BPU454"]
[null,null,null,null,null,null,"BPU455"]
[null,null,null,null,null,null,"BPU456"]
[null,null,null,null,null,null,"BPU457"]
[null,null,null,null,null,null,"BPU458"]
[null,null,null,null,null,null,"BPU459"]
[null,null,null,null,null,null,"BPU460"]
[null,null,null,null,null,null,"BPU461"]
[null,null,null,null,null,null,"BPU462"]
[null,null,null,null,null,null,"BPU463"]
[null,null,null,null,null,null,"BPU464"]
[null,null,null,null,null,null,"BPU465"]
[null,null,null,null,null,null,"BPU466"]
[null,null,null,null,null,null,"BPU467"]
[null,null,null,null,null,null,"BPU468"]
[null,null,null,null,null,null,"BPU469"]
[null,null,null,null,null,null,"BPU470"]
[null,null,null,null,null,null,"BPU471"]
[null,null,null,null,null,null,"BPU472"]
[null,null,null,null,null,null,"BPU473"]
[null,null,null,null,null,null,"BPU474"]
[null,null,null,null,null,null,"BPU475"]
[null,null,null,null,null,null,"BPU476"]
[null,null,null,null,null,null,"BPU477"]
[null,null,null,null,null,null,"BPU478"]
[null,null,null,null,null,null,"BPU479"]
[null,null,null,null,null,null,"BPU480"]
[null,null,null,null,null,null,"BPU481"]
[null,null,null,null,null,null,"BPU482"]
[null,null,null,null,null,null,"BPU483"]
[null,null,null,null,null,null,"BPU484"]
[null,null,null,null,null,null,"BPU485"]
[null,null,null,null,null,null,"BPU486"]
[null,null,null,null,null,null,"BPU487"]
[null,null,null,null,null,null,"BPU488"]
[null,null,null,null,null,null,"BPU489"]
[null,null,null,null,null,null,"BPU490"]
[null,null,null,null,null,null,"BPU491"]
[null,null,null,null,null,null,"BPU492"]
[null,null,null,null,null,null,"BPU493"]
[null,null,null,null,null,null,"BPU494"]
[null,null,null,null,null,null,"BPU495"]
[null,null,null,null,null,null,"BPU496"]
[null,null,null,null,null,null,"BPU497"]
[null,null,null,null,null,null,"BPU498"]
[null,null,null,null,null,null,"BPU499"]
[null,null,null,null,null,null,"BPU500"]

{"sheet":"DATA KAS","index":2,"n_rows":500,"n_cols":18,"rows_kept":500,"cut":false,"hidden":false,"merged":[]}
[]
[null,null,"TANGGAL","KODE KEGIATAN","KODE REKENING","URAIAN","UNTUK PEMBAYARAN (KETERANGAN DI NOTA)","NO. BUKTI","VOLUME","SATUAN","HARGA","PENGELUARAN","TEMPAT PEMBAYARAN","KODE LAMPIRAN","Pilih Nama Toko (jika ada)","Nomor","Alamat","Tanggal"]
[{"$f":"H3","v":0},{"$f":"H3&\" \"&COUNTIFS($H$3:H3,H3)","v":" 0"},"2024-04-01",null,null,"Saldo Tunai Bulan Maret 2024",null,null,{"$f":"IF(K3=\"\",\"\",L3/K3)","v":""},null,null,0,null,null,null,{"$f":"IFERROR(VLOOKUP(O3,DAFTAR_TOKO,2,FALSE),\"\")","v":""},{"$f":"IFERROR(VLOOKUP(O3,DAFTAR_TOKO,3,FALSE),\"\")","v":""},{"$f":"IF(C3=\"\",\"\",C3)","v":"2024-04-01"}]
[{"$f":"H4","v":0},{"$f":"H4&\" \"&COUNTIFS($H$3:H4,H4)","v":" 0"},"2024-04-01",null,null,"Tarik Tunai",null,null,{"$f":"IF(K4=\"\",\"\",L4/K4)","v":""},null,null,0,null,null,null,"","",{"$f":"IF(C4=\"\",\"\",C4)","v":"2024-04-01"}]
["BPU01",{"$f":"H5&\" \"&COUNTIFS($H$3:H5,H5)","v":"BPU01 1"},"2024-04-02","07.12.01.","5.1.02.02.01\n.0013","Tenten, S.Pd.",{"$f":"\"Pembayaran Honorarium Guru Honor Sekolah an. \"&F5&\" bulan Januari - April\"","v":"Pembayaran Honorarium Guru Honor Sekolah an. Tenten, S.Pd. bulan Januari - April"},"BPU01",1,"orang/bulan",{"$f":"L5","v":1100000},1100000,"Periji",null,null,"","","2024-04-02"]
["BPU01",{"$f":"H6&\" \"&COUNTIFS($H$3:H6,H6)","v":"BPU01 2"},"2024-04-02","07.12.01.","5.1.02.02.01\n.0013","Tenten, S.Pd.",{"$f":"\"Pembayaran Honorarium Guru Honor Sekolah an. \"&F6&\" bulan Januari - April\"","v":"Pembayaran Honorarium Guru Honor Sekolah an. Tenten, S.Pd. bulan Januari - April"},"BPU01",1,"orang/bulan",{"$f":"L6","v":1100000},1100000,"Periji",null,null,"","","2024-04-02"]
["BPU01",{"$f":"H7&\" \"&COUNTIFS($H$3:H7,H7)","v":"BPU01 3"},"2024-04-02","07.12.01.","5.1.02.02.01\n.0013","Tenten, S.Pd.","Pembayaran Honorarium Guru Honor Sekolah an. Tenten, S.Pd. bulan Januari - April","BPU01",1,"orang/bulan",1100000,1100000,"Periji",null,null,"","","2024-04-02"]
["BPU01",{"$f":"H8&\" \"&COUNTIFS($H$3:H8,H8)","v":"BPU01 4"},"2024-04-02","07.12.01.","5.1.02.02.01\n.0013","Tenten, S.Pd.","Pembayaran Honorarium Guru Honor Sekolah an. Tenten, S.Pd. bulan Januari - April","BPU01",1,"orang/bulan",1100000,1100000,"Periji",null,null,"","","2024-04-02"]
["BPU02",{"$f":"H9&\" \"&COUNTIFS($H$3:H9,H9)","v":"BPU02 1"},"2024-04-02","07.12.01.","5.1.02.02.01\n.0013","Sakura, S.Pd.","Pembayaran Honorarium Guru Honor Sekolah an. Sakura, S.Pd. bulan Januari - April","BPU02",1,"orang/bulan",1100000,1100000,"Periji",null,null,"","","2024-04-02"]
["BPU02",{"$f":"H10&\" \"&COUNTIFS($H$3:H10,H10)","v":"BPU02 2"},"2024-04-02","07.12.01.","5.1.02.02.01\n.0013","Sakura, S.Pd.","Pembayaran Honorarium Guru Honor Sekolah an. Sakura, S.Pd. bulan Januari - April","BPU02",1,"orang/bulan",1100000,1100000,"Periji",null,null,"","","2024-04-02"]
["BPU02",{"$f":"H11&\" \"&COUNTIFS($H$3:H11,H11)","v":"BPU02 3"},"2024-04-02","07.12.01.","5.1.02.02.01\n.0013","Sakura, S.Pd.","Pembayaran Honorarium Guru Honor Sekolah an. Sakura, S.Pd. bulan Januari - April","BPU02",1,"orang/bulan",1100000,1100000,"Periji",null,null,"","","2024-04-02"]
["BPU02",{"$f":"H12&\" \"&COUNTIFS($H$3:H12,H12)","v":"BPU02 4"},"2024-04-02","07.12.01.","5.1.02.02.01\n.0013","Sakura, S.Pd.","Pembayaran Honorarium Guru Honor Sekolah an. Sakura, S.Pd. bulan Januari - April","BPU02",1,"orang/bulan",1100000,1100000,"Periji",null,null,"","","2024-04-02"]
["BPU03",{"$f":"H13&\" \"&COUNTIFS($H$3:H13,H13)","v":"BPU03 1"},"2024-04-02","07.12.01.","5.1.02.02.01\n.0013","Kiba, S.Pd.","Pembayaran Honorarium Guru Honor Sekolah an. Kiba, S.Pd. bulan Januari - April","BPU03",1,"orang/bulan",1000000,1000000,"Periji",null,null,"","","2024-04-02"]
["BPU03",{"$f":"H14&\" \"&COUNTIFS($H$3:H14,H14)","v":"BPU03 2"},"2024-04-02","07.12.01.","5.1.02.02.01\n.0013","Kiba, S.Pd.","Pembayaran Honorarium Guru Honor Sekolah an. Kiba, S.Pd. bulan Januari - April","BPU03",1,"orang/bulan",1000000,1000000,"Periji",null,null,"","","2024-04-02"]
["BPU03",{"$f":"H15&\" \"&COUNTIFS($H$3:H15,H15)","v":"BPU03 3"},"2024-04-02","07.12.01.","5.1.02.02.01\n.0013","Kiba, S.Pd.","Pembayaran Honorarium Guru Honor Sekolah an. Kiba, S.Pd. bulan Januari - April","BPU03",1,"orang/bulan",1000000,1000000,"Periji",null,null,"","","2024-04-02"]
["BPU03",{"$f":"H16&\" \"&COUNTIFS($H$3:H16,H16)","v":"BPU03 4"},"2024-04-02","07.12.01.","5.1.02.02.01\n.0013","Kiba, S.Pd.","Pembayaran Honorarium Guru Honor Sekolah an. Kiba, S.Pd. bulan Januari - April","BPU03",1,"orang/bulan",1000000,1000000,"Periji",null,null,"","","2024-04-02"]
["BPU04",{"$f":"H17&\" \"&COUNTIFS($H$3:H17,H17)","v":"BPU04 1"},"2024-04-02","03.03.16.","5.1.02.01.01\n.0026","Foto Copy Filio dan Kuarto","Fotocopy Laporan Sekolah","BPU04",20,"Lembar",500,10000,"Kembayan",null,"Toko Percetakan Choji","006000","Jalan Ninja Nomor 2, Desa Konohagakure, Negara Api","2024-04-02"]
["BPU05",{"$f":"H18&\" \"&COUNTIFS($H$3:H18,H18)","v":"BPU05 1"},"2024-04-03","06.05.08.","5.1.02.01.01\n.0024","Penghapus Whiteboard besar GM","Pembelian ATK","BPU05",12,"pcs",16500,198000,"Kembayan",null,"Toko Senjata Tenten","005003","Jalan Ninja Nomor 2, Desa Konohagakure, Negara Api","2024-04-03"]
["BPU05",{"$f":"H19&\" \"&COUNTIFS($H$3:H19,H19)","v":"BPU05 2"},"2024-04-03","06.05.08.","5.1.02.01.01\n.0024","Kertas HVS Folio","Pembelian ATK","BPU05",10,"rim",90000,900000,"Kembayan",null,"Toko Senjata Tenten","005003","Jalan Ninja Nomor 2, Desa Konohagakure, Negara Api","2024-04-03"]
["BPU05",{"$f":"H20&\" \"&COUNTIFS($H$3:H20,H20)","v":"BPU05 3"},"2024-04-03","06.05.08.","5.1.02.01.01\n.0024","Catridge Printer IP 2770 810 Hitam- IP 2770 810 Hitam","Pembelian ATK","BPU05",1,"unit",300000,300000,"Kembayan",null,"Toko Senjata Tenten","005003","Jalan Ninja Nomor 2, Desa Konohagakure, Negara Api","2024-04-03"]
["BPU05",{"$f":"H21&\" \"&COUNTIFS($H$3:H21,H21)","v":"BPU05 4"},"2024-04-03","06.05.08.","5.1.02.01.01\n.0024","Spidol Whiteboard Warna Hitam BG 12 Snowman","Pembelian ATK","BPU05",24,"buah",10000,240000,"Kembayan",null,"Toko Senjata Tenten","005003","Jalan Ninja Nomor 2, Desa Konohagakure, Negara Api","2024-04-03"]
["BPU05",{"$f":"H22&\" \"&COUNTIFS($H$3:H22,H22)","v":"BPU05 5"},"2024-04-03","06.05.08.","5.1.02.01.01\n.0024","Catridge Printer IP 2770 811 Warna- IP 2770 811 Warna","Pembelian ATK","BPU05",1,"unit",350000,350000,"Kembayan",null,"Toko Senjata Tenten","005003","Jalan Ninja Nomor 2, Desa Konohagakure, Negara Api","2024-04-03"]
["BPU06",{"$f":"H23&\" \"&COUNTIFS($H$3:H23,H23)","v":"BPU06 1"},"2024-04-04","08.04.06.","5.1.02.01.01\n.0026","Foto Copy Filio dan Kuarto","Fotocopy soal TSSP","BPU06",3000,"Lembar",500,1500000,"Kembayan",null,"Toko Percetakan Choji","006000","Jalan Ninja Nomor 2, Desa Konohagakure, Negara Api","2024-04-04"]
["BPU07",{"$f":"H24&\" \"&COUNTIFS($H$3:H24,H24)","v":"BPU07 1"},"2024-04-04","03.03.02.","5.1.02.04.01\n.0003","Belanja Perjalanan Dinas Dalam Kota (Noyan,Jangkang,Toba)-Pejabat Fungsional Ahli Pertama / Pejabat Fungsional Terampil Penyelia / Pejabat Fungsional Terampil Pelaksana Lanjutan / Pejabat Pelaksana Golongan III : Uang Transportasi PP","Transport kegiatan Kombel KKG Gugus 2 Sungai Dangin bulan Januari","BPU07",7,"orang/kegiatan",150000,1050000,"Periji",null,null,"","","2024-04-04"]
["BPU08",{"$f":"H25&\" \"&COUNTIFS($H$3:H25,H25)","v":"BPU08 1"},"2024-04-09","06.05.02.","5.1.02.04.01\n.0003","Belanja Perjalanan Dinas Dalam Kota (Noyan,Jangkang,Toba)-Pejabat Fungsional Ahli Pertama / Pejabat Fungsional Terampil Penyelia / Pejabat Fungsional Terampil Pelaksana Lanjutan / Pejabat Pelaksana Golongan III : Uang Transportasi PP","Transport Rapat Rutin KKKS","BPU08",1,"orang/kegiatan",200000,200000,"Periji",null,null,"","","2024-04-09"]
["BPU08",{"$f":"H26&\" \"&COUNTIFS($H$3:H26,H26)","v":"BPU08 2"},"2024-04-09","06.05.02.","5.1.02.04.01\n.0003","Belanja Perjalanan Dinas Dalam Kota (Noyan,Jangkang,Toba)-Pejabat Fungsional Ahli Pertama / Pejabat Fungsional Terampil Penyelia / Pejabat Fungsional Terampil Pelaksana Lanjutan / Pejabat Pelaksana Golongan III : Uang Transportasi PP","Transport mengikuti kegiatan sosialisasi Ekinerja BKN","BPU08",2,"orang/kegiatan",200000,400000,"Periji",null,null,"","","2024-04-09"]
["BPU08",{"$f":"H27&\" \"&COUNTIFS($H$3:H27,H27)","v":"BPU08 3"},"2024-04-09","06.05.02.","5.1.02.04.01\n.0003","Belanja Perjalanan Dinas Dalam Kota (Noyan,Jangkang,Toba)-Pejabat Fungsional Ahli Pertama / Pejabat Fungsional Terampil Penyelia / Pejabat Fungsional Terampil Pelaksana Lanjutan / Pejabat Pelaksana Golongan III : Uang Transportasi PP","Transport rapat KKKS pembahasan Ekinerja BKN","BPU08",2,"orang/kegiatan",200000,400000,"Periji",null,null,"","","2024-04-09"]
["BPU08",{"$f":"H28&\" \"&COUNTIFS($H$3:H28,H28)","v":"BPU08 4"},"2024-04-09","06.05.02.","5.1.02.04.01\n.0003","Belanja Perjalanan Dinas Dalam Kota (Noyan,Jangkang,Toba)-Pejabat Fungsional Ahli Pertama / Pejabat Fungsional Terampil Penyelia / Pejabat Fungsional Terampil Pelaksana Lanjutan / Pejabat Pelaksana Golongan III : Uang Transportasi PP","Transport rapat KKKS pembahasan Ekinerja BKN lanjutan","BPU08",2,"orang/kegiatan",200000,400000,"Periji",null,null,"","","2024-04-09"]
["BPU09",{"$f":"H29&\" \"&COUNTIFS($H$3:H29,H29)","v":"BPU09 1"},"2024-04-10","05.08.01.","5.1.02.02.01\n.0030","Belanja Jasa Tenaga Kebersihan-Gaji Tenaga Kontrak Masa Kerja 0 - 2 Tahun","Pembayaran jasa tebas rumput lapangan sekolah","BPU09",2,"orang/kegiatan",100000,200000,"Periji",null,null,"","","2024-04-10"]
["BPU09",{"$f":"H30&\" \"&COUNTIFS($H$3:H30,H30)","v":"BPU09 2"},"2024-04-10","05.08.01.","5.1.02.02.01\n.0030","Belanja Jasa Tenaga Kebersihan-Gaji Tenaga Kontrak Masa Kerja 0 - 2 Tahun","Pembayaran jasa tebas rumput lapangan sekolah bulan Januari - Maret","BPU09",4,"orang/kegiatan",100000,400000,"Periji",null,null,"","","2024-04-10"]
["BPU10",{"$f":"H31&\" \"&COUNTIFS($H$3:H31,H31)","v":"BPU10 1"},"2024-04-10","03.03.16.","5.1.02.01.01\n.0052","Makan Minum Rapat","Konsumsi rapat Penyusunan Pembagian Tugas Guru dan Jadwal Pelajaran","BPU10",10,"Porsi",35000,350000,"Periji",null,"Ichiraku Ramen","009000","Jalan Ninja Nomor 1, Desa Konohagakure, Negara Api","2024-04-10"]
[0,{"$f":"H32&\" \"&COUNTIFS($H$3:H32,H32)","v":" 0"},"2024-05-01",null,null,"Saldo Tunai Bulan April 2024",null,null,"",null,null,0,null,null,null,"","","2024-05-01"]
[0,{"$f":"H33&\" \"&COUNTIFS($H$3:H33,H33)","v":" 0"},"2024-05-06",null,null,"Tarik Tunai",null,null,"",null,null,0,null,null,null,"","","2024-05-06"]
["BPU11",{"$f":"H34&\" \"&COUNTIFS($H$3:H34,H34)","v":"BPU11 1"},"2024-05-07","07.12.01.","5.1.02.02.01\n.0013","Tenten, S.Pd.",{"$f":"\"Pembayaran gaji honorarium guru honor sekolah an. \"&F34&\" bulan Mei\"","v":"Pembayaran gaji honorarium guru honor sekolah an. Tenten, S.Pd. bulan Mei"},"BPU11",1,"orang/bulan",1100000,1100000,"Periji",null,null,"","","2024-05-07"]
["BPU12",{"$f":"H35&\" \"&COUNTIFS($H$3:H35,H35)","v":"BPU12 1"},"2024-05-07","07.12.01.","5.1.02.02.01\n.0013","Sakura, S.Pd.",{"$f":"\"Pembayaran gaji honorarium guru honor sekolah an. \"&F35&\" bulan Mei\"","v":"Pembayaran gaji honorarium guru honor sekolah an. Sakura, S.Pd. bulan Mei"},"BPU12","",null,null,1100000,"Periji",null,null,"","","2024-05-07"]
["BPU13",{"$f":"H36&\" \"&COUNTIFS($H$3:H36,H36)","v":"BPU13 1"},"2024-05-07","07.12.01.","5.1.02.02.01\n.0013","Kiba, S.Pd.","Pembayaran gaji honorarium guru honor sekolah an. Kiba, S.Pd. bulan Mei","BPU13","",null,null,1000000,"Periji",null,null,"","","2024-05-07"]
["BPU14",{"$f":"H37&\" \"&COUNTIFS($H$3:H37,H37)","v":"BPU14 1"},"2024-05-08","08.04.06.","5.1.02.01.01\n.0026","Foto Copy Filio dan Kuarto","Fotocopy soal ulangan PTS","BPU14",2000,"lembar",500,1000000,"Kembayan",null,"Toko Percetakan Choji","006000","Jalan Ninja Nomor 2, Desa Konohagakure, Negara Api","2024-05-08"]
["BPU15",{"$f":"H38&\" \"&COUNTIFS($H$3:H38,H38)","v":"BPU15 1"},"2024-05-08","06.05.08.","5.1.02.01.01\n.0024","Dokumen Keeper, Clear\nSleeves, Map Clear holder A4 isi 20 DAICHI","Pembelian ATK","BPU15",20,"pcs",25000,500000,"Kembayan",null,"Toko Senjata Tenten","005003","Jalan Ninja Nomor 2, Desa Konohagakure, Negara Api","2024-05-08"]
["BPU16",{"$f":"H39&\" \"&COUNTIFS($H$3:H39,H39)","v":"BPU16 1"},"2024-05-08","06.05.02.","5.1.02.04.01\n.0003","Belanja Perjalanan Dinas Dalam Kota (Noyan,Jangkang,Toba)-Pejabat Fungsional Ahli Pertama / Pejabat Fungsional Terampil Penyelia / Pejabat Fungsional Terampil Pelaksana Lanjutan / Pejabat Pelaksana Golongan III : Uang Transportasi PP","Transport rapat rutin KKKS","BPU16",1,"orang/kegiatan",200000,200000,"Periji",null,null,"","","2024-05-08"]
["BPU17",{"$f":"H40&\" \"&COUNTIFS($H$3:H40,H40)","v":"BPU17 1"},"2024-05-30","06.05.02.","5.1.02.04.01\n.0003","Belanja Perjalanan Dinas Dalam Kota (Noyan,Jangkang,Toba)-Pejabat Fungsional Ahli Pertama / Pejabat Fungsional Terampil Penyelia / Pejabat Fungsional Terampil Pelaksana Lanjutan / Pejabat Pelaksana Golongan III : Uang Transportasi PP","Transport rapat rutin KKKS 29 Mei","BPU17",1,"orang/kegiatan",200000,200000,"Periji",null,null,"","","2024-05-30"]
[0,{"$f":"H41&\" \"&COUNTIFS($H$3:H41,H41)","v":" 0"},"2024-06-01",null,null,"Saldo Tunai Bulan Mei 2024",null,null,"",null,null,0,null,null,null,"","","2024-06-01"]
["BPU18",{"$f":"H42&\" \"&COUNTIFS($H$3:H42,H42)","v":"BPU18 1"},"2024-06-03","07.12.01.","5.1.02.02.01\n.0013","Kiba, S.Pd.",{"$f":"\"Pembayaran gaji honorarium guru honor sekolah an. \"&F42&\" bulan Juni\"","v":"Pembayaran gaji honorarium guru honor sekolah an. Kiba, S.Pd. bulan Juni"},"BPU18",1,"orang/bulan",1000000,1000000,"Periji",null,null,"","","2024-06-03"]
["BPU19",{"$f":"H43&\" \"&COUNTIFS($H$3:H43,H43)","v":"BPU19 1"},"2024-06-04","03.01.01.","5.1.02.01.01\n.0026","Spanduk","Pembelian Spanduk PPDB","BPU19",3,"m3",43000,129000,"Kembayan",null,"Toko Hyuga","002002","Jalan Ninja Nomor 3, Desa Konohagakure, Negara Api","2024-06-04"]
["BPU20",{"$f":"H44&\" \"&COUNTIFS($H$3:H44,H44)","v":"BPU20 1"},"2024-06-05","03.01.01.","5.1.02.01.01\n.0052","Makan Minum Rapat","Konsumsi rapat persiapan Pelaksanaan Pendaftaran Peserta Didik Baru (PPDB) ","BPU20",10,"Porsi",35000,350000,"Periji",null,"Ichiraku Ramen","009000","Jalan Ninja Nomor 1, Desa Konohagakure, Negara Api","2024-06-05"]
["BPU21",{"$f":"H45&\" \"&COUNTIFS($H$3:H45,H45)","v":"BPU21 1"},"2024-06-05","06.05.08.","5.1.02.01.01\n.0024","Penggaris Kayu","Pembelian ATK","BPU21",6,"buah",35000,210000,"Kembayan",null,"Toko Senjata Tenten","005003","Jalan Ninja Nomor 2, Desa Konohagakure, Negara Api","2024-06-05"]
["BPU22",{"$f":"H46&\" \"&COUNTIFS($H$3:H46,H46)","v":"BPU22 1"},"2024-06-05","08.04.06.","5.1.02.01.01\n.0026","Foto Copy Filio dan Kuarto","Fotocopy laporan soal PAS","BPU22",3000,"Lembar",500,1500000,"Kembayan",null,"Toko Percetakan Choji","006000","Jalan Ninja Nomor 2, Desa Konohagakure, Negara Api","2024-06-05"]
[0,{"$f":"H47&\" \"&COUNTIFS($H$3:H47,H47)","v":" 0"},null,null,null,null,null,null,"",null,null,null,null,null,null,"","",""]
[0,{"$f":"H48&\" \"&COUNTIFS($H$3:H48,H48)","v":" 0"},null,null,null,null,null,null,"",null,null,null,null,null,null,"","",""]
[0,{"$f":"H49&\" \"&COUNTIFS($H$3:H49,H49)","v":" 0"},null,null,null,null,null,null,"",null,null,null,null,null,null,"","",""]
[0,{"$f":"H50&\" \"&COUNTIFS($H$3:H50,H50)","v":" 0"},null,null,null,null,null,null,"",null,null,null,null,null,null,"","",""]
[0,{"$f":"H51&\" \"&COUNTIFS($H$3:H51,H51)","v":" 0"},null,null,null,null,null,null,"",null,null,null,null,null,null,"","",""]
[0,{"$f":"H52&\" \"&COUNTIFS($H$3:H52,H52)","v":" 0"},null,null,null,null,null,null,"",null,null,null,null,null,null,"","",""]
[0,{"$f":"H53&\" \"&COUNTIFS($H$3:H53,H53)","v":" 0"},null,null,null,null,null,null,"",null,null,null,null,null,null,"","",""]
[0,{"$f":"H54&\" \"&COUNTIFS($H$3:H54,H54)","v":" 0"},null,null,null,null,null,null,"",null,null,null,null,null,null,"","",""]
[0,{"$f":"H55&\" \"&COUNTIFS($H$3:H55,H55)","v":" 0"},null,null,null,null,null,null,"",null,null,null,null,null,null,"","",""]
[0,{"$f":"H56&\" \"&COUNTIFS($H$3:H56,H56)","v":" 0"},null,null,null,null,null,null,"",null,null,null,null,null,null,"","",""]
[0,{"$f":"H57&\" \"&COUNTIFS($H$3:H57,H57)","v":" 0"},null,null,null,null,null,null,"",null,null,null,null,null,null,"","",""]
[0,{"$f":"H58&\" \"&COUNTIFS($H$3:H58,H58)","v":" 0"},null,null,null,null,null,null,"",null,null,null,null,null,null,"","",""]
[0,{"$f":"H59&\" \"&COUNTIFS($H$3:H59,H59)","v":" 0"},null,null,null,null,null,null,"",null,null,null,null,null,null,"","",""]
[0,{"$f":"H60&\" \"&COUNTIFS($H$3:H60,H60)","v":" 0"},null,null,null,null,null,null,"",null,null,null,null,null,null,"","",""]
[0,{"$f":"H61&\" \"&COUNTIFS($H$3:H61,H61)","v":" 0"},null,null,null,null,null,null,"",null,null,null,null,null,null,"","",""]
[0,{"$f":"H62&\" \"&COUNTIFS($H$3:H62,H62)","v":" 0"},null,null,null,null,null,null,"",null,null,null,null,null,null,"","",""]
[0,{"$f":"H63&\" \"&COUNTIFS($H$3:H63,H63)","v":" 0"},null,null,null,null,null,null,"",null,null,null,null,null,null,"","",""]
[0,{"$f":"H64&\" \"&COUNTIFS($H$3:H64,H64)","v":" 0"},null,null,null,null,null,null,"",null,null,null,null,null,null,"","",""]
[0,{"$f":"H65&\" \"&COUNTIFS($H$3:H65,H65)","v":" 0"},null,null,null,null,null,null,"",null,null,null,null,null,null,"","",""]
[0,{"$f":"H66&\" \"&COUNTIFS($H$3:H66,H66)","v":" 0"},null,null,null,null,null,null,"",null,null,null,null,null,null,"","",""]
[0,{"$f":"H67&\" \"&COUNTIFS($H$3:H67,H67)","v":" 0"},null,null,null,null,null,null,"",null,null,null,null,null,null,{"$f":"IFERROR(VLOOKUP(O67,DAFTAR_TOKO,2,FALSE),\"\")","v":""},{"$f":"IFERROR(VLOOKUP(O67,DAFTAR_TOKO,3,FALSE),\"\")","v":""},""]
[{"$f":"H68","v":0},{"$f":"H68&\" \"&COUNTIFS($H$3:H68,H68)","v":" 0"},null,null,null,null,null,null,{"$f":"IF(K68=\"\",\"\",L68/K68)","v":""},null,null,null,null,null,null,"","",{"$f":"IF(C68=\"\",\"\",C68)","v":""}]
[0,{"$f":"H69&\" \"&COUNTIFS($H$3:H69,H69)","v":" 0"},null,null,null,null,null,null,"",null,null,null,null,null,null,"","",""]
[0,{"$f":"H70&\" \"&COUNTIFS($H$3:H70,H70)","v":" 0"},null,null,null,null,null,null,"",null,null,null,null,null,null,"","",""]
[0,{"$f":"H71&\" \"&COUNTIFS($H$3:H71,H71)","v":" 0"},null,null,null,null,null,null,"","Orang",null,null,null,null,null,"","",""]
[0,{"$f":"H72&\" \"&COUNTIFS($H$3:H72,H72)","v":" 0"},null,null,null,null,null,null,"","Orang",null,null,null,null,null,"","",""]
[0,{"$f":"H73&\" \"&COUNTIFS($H$3:H73,H73)","v":" 0"},null,null,null,null,null,null,"","Hari",null,null,null,null,null,"","",""]
[0,{"$f":"H74&\" \"&COUNTIFS($H$3:H74,H74)","v":" 0"},null,null,null,null,null,null,"","Hari",null,null,null,null,null,"","",""]
[0,{"$f":"H75&\" \"&COUNTIFS($H$3:H75,H75)","v":" 0"},null,null,null,null,null,null,"","Bulan",null,null,null,null,null,"","",""]
[0,{"$f":"H76&\" \"&COUNTIFS($H$3:H76,H76)","v":" 0"},null,null,null,null,null,null,"","Hari",null,null,null,null,null,"","",""]
[0,{"$f":"H77&\" \"&COUNTIFS($H$3:H77,H77)","v":" 0"},null,null,null,null,null,null,"","Hari",null,null,null,null,null,"","",""]
[0,{"$f":"H78&\" \"&COUNTIFS($H$3:H78,H78)","v":" 0"},null,null,null,null,null,null,"","Hari",null,null,null,null,null,"","",""]
[0,{"$f":"H79&\" \"&COUNTIFS($H$3:H79,H79)","v":" 0"},null,null,null,null,null,null,"","Hari",null,null,null,null,null,"","",""]
[0,{"$f":"H80&\" \"&COUNTIFS($H$3:H80,H80)","v":" 0"},null,null,null,null,null,null,"","Porsi",null,null,null,null,null,"","",""]
[0,{"$f":"H81&\" \"&COUNTIFS($H$3:H81,H81)","v":" 0"},null,null,null,null,null,null,"",null,null,null,null,null,null,"","",""]
[0,{"$f":"H82&\" \"&COUNTIFS($H$3:H82,H82)","v":" 0"},null,null,null,null,null,null,"","Orang",null,null,null,null,null,"","",""]
[0,{"$f":"H83&\" \"&COUNTIFS($H$3:H83,H83)","v":" 0"},null,null,null,null,null,null,"","Orang",null,null,null,null,null,"","",""]
[0,{"$f":"H84&\" \"&COUNTIFS($H$3:H84,H84)","v":" 0"},null,null,null,null,null,null,"","Orang",null,null,null,null,null,"","",""]
[0,{"$f":"H85&\" \"&COUNTIFS($H$3:H85,H85)","v":" 0"},null,null,null,null,null,null,"","Orang",null,null,null,null,null,"","",""]
[0,{"$f":"H86&\" \"&COUNTIFS($H$3:H86,H86)","v":" 0"},null,null,null,null,null,null,"","Hari",null,null,null,null,null,"","",""]
[0,{"$f":"H87&\" \"&COUNTIFS($H$3:H87,H87)","v":" 0"},null,null,null,null,null,null,"","Hari",null,null,null,null,null,"","",""]
[0,{"$f":"H88&\" \"&COUNTIFS($H$3:H88,H88)","v":" 0"},null,null,null,null,null,null,"","Bulan",null,null,null,null,null,"","",""]
[0,{"$f":"H89&\" \"&COUNTIFS($H$3:H89,H89)","v":" 0"},null,null,null,null,null,null,"","Buah",null,null,null,null,null,"","",""]
[0,{"$f":"H90&\" \"&COUNTIFS($H$3:H90,H90)","v":" 0"},null,null,null,null,null,null,"","Pak",null,null,null,null,null,"","",""]
[0,{"$f":"H91&\" \"&COUNTIFS($H$3:H91,H91)","v":" 0"},null,null,null,null,null,null,{"$f":"IF(K91=\"\",\"\",L91/K91)","v":""},"Bulan",null,null,null,null,null,"","",""]
[0,{"$f":"H92&\" \"&COUNTIFS($H$3:H92,H92)","v":" 0"},null,null,null,null,null,null,"","Bulan",null,null,null,null,null,"","",""]
[0,{"$f":"H93&\" \"&COUNTIFS($H$3:H93,H93)","v":" 0"},null,null,null,null,null,null,"","Lembar",null,null,null,null,null,"","",""]
[0,{"$f":"H94&\" \"&COUNTIFS($H$3:H94,H94)","v":" 0"},null,null,null,null,null,null,"","Bulan",null,null,null,null,null,"","",""]
[0,{"$f":"H95&\" \"&COUNTIFS($H$3:H95,H95)","v":" 0"},null,null,null,null,null,null,"","Bulan",null,null,null,null,null,"","",""]
[0,{"$f":"H96&\" \"&COUNTIFS($H$3:H96,H96)","v":" 0"},null,null,null,null,null,null,"","Bulan",null,null,null,null,null,"","",""]
[0,{"$f":"H97&\" \"&COUNTIFS($H$3:H97,H97)","v":" 0"},null,null,null,null,null,null,"","Orang",null,null,null,null,null,"","",""]
[0,{"$f":"H98&\" \"&COUNTIFS($H$3:H98,H98)","v":" 0"},null,null,null,null,null,null,"","Lembar",null,null,null,null,null,"","",""]
[0,{"$f":"H99&\" \"&COUNTIFS($H$3:H99,H99)","v":" 0"},null,null,null,null,null,null,"","Orang",null,null,null,null,null,"","",""]
[0,{"$f":"H100&\" \"&COUNTIFS($H$3:H100,H100)","v":" 0"},null,null,null,null,null,null,"","Unit",null,null,null,null,null,"","",""]
[0,{"$f":"H101&\" \"&COUNTIFS($H$3:H101,H101)","v":" 0"},null,null,null,null,null,null,"","Orang",null,null,null,null,null,"","",""]
[0,{"$f":"H102&\" \"&COUNTIFS($H$3:H102,H102)","v":" 0"},null,null,null,null,null,null,"",null,null,null,null,null,null,"","",""]
[0,{"$f":"H103&\" \"&COUNTIFS($H$3:H103,H103)","v":" 0"},null,null,null,null,null,null,"",null,null,null,null,null,null,"","",""]
[0,{"$f":"H104&\" \"&COUNTIFS($H$3:H104,H104)","v":" 0"},null,null,null,null,null,null,"",null,null,null,null,null,null,"","",""]
[0,{"$f":"H105&\" \"&COUNTIFS($H$3:H105,H105)","v":" 0"},null,null,null,null,null,null,"",null,null,null,null,null,null,"","",""]
[0,{"$f":"H106&\" \"&COUNTIFS($H$3:H106,H106)","v":" 0"},null,null,null,null,null,null,"",null,null,null,null,null,null,"","",""]
[0,{"$f":"H107&\" \"&COUNTIFS($H$3:H107,H107)","v":" 0"},null,null,null,null,null,null,"",null,null,null,null,null,null,"","",""]
[0,{"$f":"H108&\" \"&COUNTIFS($H$3:H108,H108)","v":" 0"},null,null,null,null,null,null,"",null,null,null,null,null,null,"","",""]
[0,{"$f":"H109&\" \"&COUNTIFS($H$3:H109,H109)","v":" 0"},null,null,null,null,null,null,"",null,null,null,null,null,null,"","",""]
[0,{"$f":"H110&\" \"&COUNTIFS($H$3:H110,H110)","v":" 0"},null,null,null,null,null,null,"",null,null,null,null,null,null,"","",""]
[0,{"$f":"H111&\" \"&COUNTIFS($H$3:H111,H111)","v":" 0"},null,null,null,null,null,null,"",null,null,null,null,null,null,"","",""]
[0,{"$f":"H112&\" \"&COUNTIFS($H$3:H112,H112)","v":" 0"},null,null,null,null,null,null,"",null,null,null,null,null,null,"","",""]
[0,{"$f":"H113&\" \"&COUNTIFS($H$3:H113,H113)","v":" 0"},null,null,null,null,null,null,"",null,null,null,null,null,null,"","",""]
[0,{"$f":"H114&\" \"&COUNTIFS($H$3:H114,H114)","v":" 0"},null,null,null,null,null,null,"",null,null,null,null,null,null,"","",""]
[0,{"$f":"H115&\" \"&COUNTIFS($H$3:H115,H115)","v":" 0"},null,null,null,null,null,null,"",null,null,null,null,null,null,"","",""]
[0,{"$f":"H116&\" \"&COUNTIFS($H$3:H116,H116)","v":" 0"},null,null,null,null,null,null,"",null,null,null,null,null,null,"","",""]
[0,{"$f":"H117&\" \"&COUNTIFS($H$3:H117,H117)","v":" 0"},null,null,null,null,null,null,"",null,null,null,null,null,null,"","",""]
[0,{"$f":"H118&\" \"&COUNTIFS($H$3:H118,H118)","v":" 0"},null,null,null,null,null,null,"",null,null,null,null,null,null,"","",""]
[0,{"$f":"H119&\" \"&COUNTIFS($H$3:H119,H119)","v":" 0"},null,null,null,null,null,null,"",null,null,null,null,null,null,"","",""]
[0,{"$f":"H120&\" \"&COUNTIFS($H$3:H120,H120)","v":" 0"},null,null,null,null,null,null,"",null,null,null,null,null,null,"","",""]
[0,{"$f":"H121&\" \"&COUNTIFS($H$3:H121,H121)","v":" 0"},null,null,null,null,null,null,"",null,null,null,null,null,null,"","",""]
[0,{"$f":"H122&\" \"&COUNTIFS($H$3:H122,H122)","v":" 0"},null,null,null,null,null,null,"",null,null,null,null,null,null,"","",""]
[0,{"$f":"H123&\" \"&COUNTIFS($H$3:H123,H123)","v":" 0"},null,null,null,null,null,null,"",null,null,null,null,null,null,"","",""]
[0,{"$f":"H124&\" \"&COUNTIFS($H$3:H124,H124)","v":" 0"},null,null,null,null,null,null,"",null,null,null,null,null,null,"","",""]
[0,{"$f":"H125&\" \"&COUNTIFS($H$3:H125,H125)","v":" 0"},null,null,null,null,null,null,"",null,null,null,null,null,null,"","",""]
[0,{"$f":"H126&\" \"&COUNTIFS($H$3:H126,H126)","v":" 0"},null,null,null,null,null,null,"",null,null,null,null,null,null,"","",""]
[0,{"$f":"H127&\" \"&COUNTIFS($H$3:H127,H127)","v":" 0"},null,null,null,null,null,null,"",null,null,null,null,null,null,"","",""]
[0,{"$f":"H128&\" \"&COUNTIFS($H$3:H128,H128)","v":" 0"},null,null,null,null,null,null,"",null,null,null,null,null,null,"","",""]
[0,{"$f":"H129&\" \"&COUNTIFS($H$3:H129,H129)","v":" 0"},null,null,null,null,null,null,"",null,null,null,null,null,null,"","",""]
[0,{"$f":"H130&\" \"&COUNTIFS($H$3:H130,H130)","v":" 0"},null,null,null,null,null,null,"",null,null,null,null,null,null,"","",""]
[0,{"$f":"H131&\" \"&COUNTIFS($H$3:H131,H131)","v":" 0"},null,null,null,null,null,null,"",null,null,null,null,null,null,{"$f":"IFERROR(VLOOKUP(O131,DAFTAR_TOKO,2,FALSE),\"\")","v":""},{"$f":"IFERROR(VLOOKUP(O131,DAFTAR_TOKO,3,FALSE),\"\")","v":""},""]
[{"$f":"H132","v":0},{"$f":"H132&\" \"&COUNTIFS($H$3:H132,H132)","v":" 0"},null,null,null,null,null,null,{"$f":"IF(K132=\"\",\"\",L132/K132)","v":""},null,null,null,null,null,null,"","",{"$f":"IF(C132=\"\",\"\",C132)","v":""}]
[0,{"$f":"H133&\" \"&COUNTIFS($H$3:H133,H133)","v":" 0"},null,null,null,null,null,null,"",null,null,null,null,null,null,"","",""]
[0,{"$f":"H134&\" \"&COUNTIFS($H$3:H134,H134)","v":" 0"},null,null,null,null,null,null,"",null,null,null,null,null,null,"","",""]
[0,{"$f":"H135&\" \"&COUNTIFS($H$3:H135,H135)","v":" 0"},null,null,null,null,null,null,"",null,null,null,null,null,null,"","",""]
[0,{"$f":"H136&\" \"&COUNTIFS($H$3:H136,H136)","v":" 0"},null,null,null,null,null,null,"",null,null,null,null,null,null,"","",""]
[0,{"$f":"H137&\" \"&COUNTIFS($H$3:H137,H137)","v":" 0"},null,null,null,null,null,null,"",null,null,null,null,null,null,"","",""]
[0,{"$f":"H138&\" \"&COUNTIFS($H$3:H138,H138)","v":" 0"},null,null,null,null,null,null,"",null,null,null,null,null,null,"","",""]
[0,{"$f":"H139&\" \"&COUNTIFS($H$3:H139,H139)","v":" 0"},null,null,null,null,null,null,"",null,null,null,null,null,null,"","",""]
[0,{"$f":"H140&\" \"&COUNTIFS($H$3:H140,H140)","v":" 0"},null,null,null,null,null,null,"",null,null,null,null,null,null,"","",""]
[0,{"$f":"H141&\" \"&COUNTIFS($H$3:H141,H141)","v":" 0"},null,null,null,null,null,null,"",null,null,null,null,null,null,"","",""]
[0,{"$f":"H142&\" \"&COUNTIFS($H$3:H142,H142)","v":" 0"},null,null,null,null,null,null,"",null,null,null,null,null,null,"","",""]
[0,{"$f":"H143&\" \"&COUNTIFS($H$3:H143,H143)","v":" 0"},null,null,null,null,null,null,"",null,null,null,null,null,null,"","",""]
[0,{"$f":"H144&\" \"&COUNTIFS($H$3:H144,H144)","v":" 0"},null,null,null,null,null,null,"",null,null,null,null,null,null,"","",""]
[0,{"$f":"H145&\" \"&COUNTIFS($H$3:H145,H145)","v":" 0"},null,null,null,null,null,null,"",null,null,null,null,null,null,"","",""]
[0,{"$f":"H146&\" \"&COUNTIFS($H$3:H146,H146)","v":" 0"},null,null,null,null,null,null,"",null,null,null,null,null,null,"","",""]
[0,{"$f":"H147&\" \"&COUNTIFS($H$3:H147,H147)","v":" 0"},null,null,null,null,null,null,"",null,null,null,null,null,null,"","",""]
[0,{"$f":"H148&\" \"&COUNTIFS($H$3:H148,H148)","v":" 0"},null,null,null,null,null,null,"",null,null,null,null,null,null,"","",""]
[0,{"$f":"H149&\" \"&COUNTIFS($H$3:H149,H149)","v":" 0"},null,null,null,null,null,null,"",null,null,null,null,null,null,"","",""]
[0,{"$f":"H150&\" \"&COUNTIFS($H$3:H150,H150)","v":" 0"},null,null,null,null,null,null,"",null,null,null,null,null,null,"","",""]
[0,{"$f":"H151&\" \"&COUNTIFS($H$3:H151,H151)","v":" 0"},null,null,null,null,null,null,"",null,null,null,null,null,null,"","",""]
[0,{"$f":"H152&\" \"&COUNTIFS($H$3:H152,H152)","v":" 0"},null,null,null,null,null,null,"",null,null,null,null,null,null,"","",""]
[0,{"$f":"H153&\" \"&COUNTIFS($H$3:H153,H153)","v":" 0"},null,null,null,null,null,null,"",null,null,null,null,null,null,"","",""]
[0,{"$f":"H154&\" \"&COUNTIFS($H$3:H154,H154)","v":" 0"},null,null,null,null,null,null,"",null,null,null,null,null,null,"","",""]
[0,{"$f":"H155&\" \"&COUNTIFS($H$3:H155,H155)","v":" 0"},null,null,null,null,null,null,"",null,null,null,null,null,null,"","",""]
[0,{"$f":"H156&\" \"&COUNTIFS($H$3:H156,H156)","v":" 0"},null,null,null,null,null,null,"",null,null,null,null,null,null,"","",""]
[0,{"$f":"H157&\" \"&COUNTIFS($H$3:H157,H157)","v":" 0"},null,null,null,null,null,null,"",null,null,null,null,null,null,"","",""]
[0,{"$f":"H158&\" \"&COUNTIFS($H$3:H158,H158)","v":" 0"},null,null,null,null,null,null,"",null,null,null,null,null,null,"","",""]
[0,{"$f":"H159&\" \"&COUNTIFS($H$3:H159,H159)","v":" 0"},null,null,null,null,null,null,"",null,null,null,null,null,null,"","",""]
[0,{"$f":"H160&\" \"&COUNTIFS($H$3:H160,H160)","v":" 0"},null,null,null,null,null,null,"",null,null,null,null,null,null,"","",""]
[0,{"$f":"H161&\" \"&COUNTIFS($H$3:H161,H161)","v":" 0"},null,null,null,null,null,null,"",null,null,null,null,null,null,"","",""]
[0,{"$f":"H162&\" \"&COUNTIFS($H$3:H162,H162)","v":" 0"},null,null,null,null,null,null,"",null,null,null,null,null,null,"","",""]
[0,{"$f":"H163&\" \"&COUNTIFS($H$3:H163,H163)","v":" 0"},null,null,null,null,null,null,"",null,null,null,null,null,null,"","",""]
[0,{"$f":"H164&\" \"&COUNTIFS($H$3:H164,H164)","v":" 0"},null,null,null,null,null,null,"",null,null,null,null,null,null,"","",""]
[0,{"$f":"H165&\" \"&COUNTIFS($H$3:H165,H165)","v":" 0"},null,null,null,null,null,null,"",null,null,null,null,null,null,"","",""]
[0,{"$f":"H166&\" \"&COUNTIFS($H$3:H166,H166)","v":" 0"},null,null,null,null,null,null,"",null,null,null,null,null,null,"","",""]
[0,{"$f":"H167&\" \"&COUNTIFS($H$3:H167,H167)","v":" 0"},null,null,null,null,null,null,"",null,null,null,null,null,null,"","",""]
[0,{"$f":"H168&\" \"&COUNTIFS($H$3:H168,H168)","v":" 0"},null,null,null,null,null,null,"",null,null,null,null,null,null,"","",""]
[0,{"$f":"H169&\" \"&COUNTIFS($H$3:H169,H169)","v":" 0"},null,null,null,null,null,null,"",null,null,null,null,null,null,"","",""]
[0,{"$f":"H170&\" \"&COUNTIFS($H$3:H170,H170)","v":" 0"},null,null,null,null,null,null,"",null,null,null,null,null,null,"","",""]
[0,{"$f":"H171&\" \"&COUNTIFS($H$3:H171,H171)","v":" 0"},null,null,null,null,null,null,"",null,null,null,null,null,null,"","",""]
[0,{"$f":"H172&\" \"&COUNTIFS($H$3:H172,H172)","v":" 0"},null,null,null,null,null,null,"",null,null,null,null,null,null,"","",""]
[0,{"$f":"H173&\" \"&COUNTIFS($H$3:H173,H173)","v":" 0"},null,null,null,null,null,null,"",null,null,null,null,null,null,"","",""]
[0,{"$f":"H174&\" \"&COUNTIFS($H$3:H174,H174)","v":" 0"},null,null,null,null,null,null,"",null,null,null,null,null,null,"","",""]
[0,{"$f":"H175&\" \"&COUNTIFS($H$3:H175,H175)","v":" 0"},null,null,null,null,null,null,"",null,null,null,null,null,null,"","",""]
[0,{"$f":"H176&\" \"&COUNTIFS($H$3:H176,H176)","v":" 0"},null,null,null,null,null,null,"",null,null,null,null,null,null,"","",""]
[0,{"$f":"H177&\" \"&COUNTIFS($H$3:H177,H177)","v":" 0"},null,null,null,null,null,null,"",null,null,null,null,null,null,"","",""]
[0,{"$f":"H178&\" \"&COUNTIFS($H$3:H178,H178)","v":" 0"},null,null,null,null,null,null,"",null,null,null,null,null,null,"","",""]
[0,{"$f":"H179&\" \"&COUNTIFS($H$3:H179,H179)","v":" 0"},null,null,null,null,null,null,"",null,null,null,null,null,null,"","",""]
[0,{"$f":"H180&\" \"&COUNTIFS($H$3:H180,H180)","v":" 0"},null,null,null,null,null,null,"",null,null,null,null,null,null,"","",""]
[0,{"$f":"H181&\" \"&COUNTIFS($H$3:H181,H181)","v":" 0"},null,null,null,null,null,null,"",null,null,null,null,null,null,"","",""]
[0,{"$f":"H182&\" \"&COUNTIFS($H$3:H182,H182)","v":" 0"},null,null,null,null,null,null,"",null,null,null,null,null,null,"","",""]
[0,{"$f":"H183&\" \"&COUNTIFS($H$3:H183,H183)","v":" 0"},null,null,null,null,null,null,"",null,null,null,null,null,null,"","",""]
[0,{"$f":"H184&\" \"&COUNTIFS($H$3:H184,H184)","v":" 0"},null,null,null,null,null,null,"",null,null,null,null,null,null,"","",""]
[0,{"$f":"H185&\" \"&COUNTIFS($H$3:H185,H185)","v":" 0"},null,null,null,null,null,null,"",null,null,null,null,null,null,"","",""]
[0,{"$f":"H186&\" \"&COUNTIFS($H$3:H186,H186)","v":" 0"},null,null,null,null,null,null,"",null,null,null,null,null,null,"","",""]
[0,{"$f":"H187&\" \"&COUNTIFS($H$3:H187,H187)","v":" 0"},null,null,null,null,null,null,"",null,null,null,null,null,null,"","",""]
[0,{"$f":"H188&\" \"&COUNTIFS($H$3:H188,H188)","v":" 0"},null,null,null,null,null,null,"",null,null,null,null,null,null,"","",""]
[0,{"$f":"H189&\" \"&COUNTIFS($H$3:H189,H189)","v":" 0"},null,null,null,null,null,null,"",null,null,null,null,null,null,"","",""]
[0,{"$f":"H190&\" \"&COUNTIFS($H$3:H190,H190)","v":" 0"},null,null,null,null,null,null,"",null,null,null,null,null,null,"","",""]
[0,{"$f":"H191&\" \"&COUNTIFS($H$3:H191,H191)","v":" 0"},null,null,null,null,null,null,"",null,null,null,null,null,null,"","",""]
[0,{"$f":"H192&\" \"&COUNTIFS($H$3:H192,H192)","v":" 0"},null,null,null,null,null,null,"",null,null,null,null,null,null,"","",""]
[0,{"$f":"H193&\" \"&COUNTIFS($H$3:H193,H193)","v":" 0"},null,null,null,null,null,null,"",null,null,null,null,null,null,"","",""]
[0,{"$f":"H194&\" \"&COUNTIFS($H$3:H194,H194)","v":" 0"},null,null,null,null,null,null,"",null,null,null,null,null,null,"","",""]
[0,{"$f":"H195&\" \"&COUNTIFS($H$3:H195,H195)","v":" 0"},null,null,null,null,null,null,"",null,null,null,null,null,null,{"$f":"IFERROR(VLOOKUP(O195,DAFTAR_TOKO,2,FALSE),\"\")","v":""},{"$f":"IFERROR(VLOOKUP(O195,DAFTAR_TOKO,3,FALSE),\"\")","v":""},""]
[{"$f":"H196","v":0},{"$f":"H196&\" \"&COUNTIFS($H$3:H196,H196)","v":" 0"},null,null,null,null,null,null,{"$f":"IF(K196=\"\",\"\",L196/K196)","v":""},null,null,null,null,null,null,"","",{"$f":"IF(C196=\"\",\"\",C196)","v":""}]
[0,{"$f":"H197&\" \"&COUNTIFS($H$3:H197,H197)","v":" 0"},null,null,null,null,null,null,"",null,null,null,null,null,null,"","",""]
[0,{"$f":"H198&\" \"&COUNTIFS($H$3:H198,H198)","v":" 0"},null,null,null,null,null,null,"",null,null,null,null,null,null,"","",""]
[0,{"$f":"H199&\" \"&COUNTIFS($H$3:H199,H199)","v":" 0"},null,null,null,null,null,null,"",null,null,null,null,null,null,"","",""]
[0,{"$f":"H200&\" \"&COUNTIFS($H$3:H200,H200)","v":" 0"},null,null,null,null,null,null,"",null,null,null,null,null,null,"","",""]
[0,{"$f":"H201&\" \"&COUNTIFS($H$3:H201,H201)","v":" 0"},null,null,null,null,null,null,"",null,null,null,null,null,null,"","",""]
[0,{"$f":"H202&\" \"&COUNTIFS($H$3:H202,H202)","v":" 0"},null,null,null,null,null,null,"",null,null,null,null,null,null,"","",""]
[0,{"$f":"H203&\" \"&COUNTIFS($H$3:H203,H203)","v":" 0"},null,null,null,null,null,null,"",null,null,null,null,null,null,"","",""]
[0,{"$f":"H204&\" \"&COUNTIFS($H$3:H204,H204)","v":" 0"},null,null,null,null,null,null,"",null,null,null,null,null,null,"","",""]
[0,{"$f":"H205&\" \"&COUNTIFS($H$3:H205,H205)","v":" 0"},null,null,null,null,null,null,"",null,null,null,null,null,null,"","",""]
[0,{"$f":"H206&\" \"&COUNTIFS($H$3:H206,H206)","v":" 0"},null,null,null,null,null,null,"",null,null,null,null,null,null,"","",""]
[0,{"$f":"H207&\" \"&COUNTIFS($H$3:H207,H207)","v":" 0"},null,null,null,null,null,null,"",null,null,null,null,null,null,"","",""]
[0,{"$f":"H208&\" \"&COUNTIFS($H$3:H208,H208)","v":" 0"},null,null,null,null,null,null,"",null,null,null,null,null,null,"","",""]
[0,{"$f":"H209&\" \"&COUNTIFS($H$3:H209,H209)","v":" 0"},null,null,null,null,null,null,"",null,null,null,null,null,null,"","",""]
[0,{"$f":"H210&\" \"&COUNTIFS($H$3:H210,H210)","v":" 0"},null,null,null,null,null,null,"",null,null,null,null,null,null,"","",""]
[0,{"$f":"H211&\" \"&COUNTIFS($H$3:H211,H211)","v":" 0"},null,null,null,null,null,null,"",null,null,null,null,null,null,"","",""]
[0,{"$f":"H212&\" \"&COUNTIFS($H$3:H212,H212)","v":" 0"},null,null,null,null,null,null,"",null,null,null,null,null,null,"","",""]
[0,{"$f":"H213&\" \"&COUNTIFS($H$3:H213,H213)","v":" 0"},null,null,null,null,null,null,"",null,null,null,null,null,null,"","",""]
[0,{"$f":"H214&\" \"&COUNTIFS($H$3:H214,H214)","v":" 0"},null,null,null,null,null,null,"",null,null,null,null,null,null,"","",""]
[0,{"$f":"H215&\" \"&COUNTIFS($H$3:H215,H215)","v":" 0"},null,null,null,null,null,null,"",null,null,null,null,null,null,"","",""]
[0,{"$f":"H216&\" \"&COUNTIFS($H$3:H216,H216)","v":" 0"},null,null,null,null,null,null,"",null,null,null,null,null,null,"","",""]
[0,{"$f":"H217&\" \"&COUNTIFS($H$3:H217,H217)","v":" 0"},null,null,null,null,null,null,"",null,null,null,null,null,null,"","",""]
[0,{"$f":"H218&\" \"&COUNTIFS($H$3:H218,H218)","v":" 0"},null,null,null,null,null,null,"",null,null,null,null,null,null,"","",""]
[0,{"$f":"H219&\" \"&COUNTIFS($H$3:H219,H219)","v":" 0"},null,null,null,null,null,null,"",null,null,null,null,null,null,"","",""]
[0,{"$f":"H220&\" \"&COUNTIFS($H$3:H220,H220)","v":" 0"},null,null,null,null,null,null,"",null,null,null,null,null,null,"","",""]
[0,{"$f":"H221&\" \"&COUNTIFS($H$3:H221,H221)","v":" 0"},null,null,null,null,null,null,"",null,null,null,null,null,null,"","",""]
[0,{"$f":"H222&\" \"&COUNTIFS($H$3:H222,H222)","v":" 0"},null,null,null,null,null,null,"",null,null,null,null,null,null,"","",""]
[0,{"$f":"H223&\" \"&COUNTIFS($H$3:H223,H223)","v":" 0"},null,null,null,null,null,null,"",null,null,null,null,null,null,"","",""]
[0,{"$f":"H224&\" \"&COUNTIFS($H$3:H224,H224)","v":" 0"},null,null,null,null,null,null,"",null,null,null,null,null,null,"","",""]
[0,{"$f":"H225&\" \"&COUNTIFS($H$3:H225,H225)","v":" 0"},null,null,null,null,null,null,"",null,null,null,null,null,null,"","",""]
[0,{"$f":"H226&\" \"&COUNTIFS($H$3:H226,H226)","v":" 0"},null,null,null,null,null,null,"",null,null,null,null,null,null,"","",""]
[0,{"$f":"H227&\" \"&COUNTIFS($H$3:H227,H227)","v":" 0"},null,null,null,null,null,null,"",null,null,null,null,null,null,"","",""]
[0,{"$f":"H228&\" \"&COUNTIFS($H$3:H228,H228)","v":" 0"},null,null,null,null,null,null,"",null,null,null,null,null,null,"","",""]
[0,{"$f":"H229&\" \"&COUNTIFS($H$3:H229,H229)","v":" 0"},null,null,null,null,null,null,"",null,null,null,null,null,null,"","",""]
[0,{"$f":"H230&\" \"&COUNTIFS($H$3:H230,H230)","v":" 0"},null,null,null,null,null,null,"",null,null,null,null,null,null,"","",""]
[0,{"$f":"H231&\" \"&COUNTIFS($H$3:H231,H231)","v":" 0"},null,null,null,null,null,null,"",null,null,null,null,null,null,"","",""]
[0,{"$f":"H232&\" \"&COUNTIFS($H$3:H232,H232)","v":" 0"},null,null,null,null,null,null,"",null,null,null,null,null,null,"","",""]
[0,{"$f":"H233&\" \"&COUNTIFS($H$3:H233,H233)","v":" 0"},null,null,null,null,null,null,"",null,null,null,null,null,null,"","",""]
[0,{"$f":"H234&\" \"&COUNTIFS($H$3:H234,H234)","v":" 0"},null,null,null,null,null,null,"",null,null,null,null,null,null,"","",""]
[0,{"$f":"H235&\" \"&COUNTIFS($H$3:H235,H235)","v":" 0"},null,null,null,null,null,null,"",null,null,null,null,null,null,"","",""]
[0,{"$f":"H236&\" \"&COUNTIFS($H$3:H236,H236)","v":" 0"},null,null,null,null,null,null,"",null,null,null,null,null,null,"","",""]
[0,{"$f":"H237&\" \"&COUNTIFS($H$3:H237,H237)","v":" 0"},null,null,null,null,null,null,"",null,null,null,null,null,null,"","",""]
[0,{"$f":"H238&\" \"&COUNTIFS($H$3:H238,H238)","v":" 0"},null,null,null,null,null,null,"",null,null,null,null,null,null,"","",""]
[0,{"$f":"H239&\" \"&COUNTIFS($H$3:H239,H239)","v":" 0"},null,null,null,null,null,null,"",null,null,null,null,null,null,"","",""]
[0,{"$f":"H240&\" \"&COUNTIFS($H$3:H240,H240)","v":" 0"},null,null,null,null,null,null,"",null,null,null,null,null,null,"","",""]
[0,{"$f":"H241&\" \"&COUNTIFS($H$3:H241,H241)","v":" 0"},null,null,null,null,null,null,"",null,null,null,null,null,null,"","",""]
[0,{"$f":"H242&\" \"&COUNTIFS($H$3:H242,H242)","v":" 0"},null,null,null,null,null,null,"",null,null,null,null,null,null,"","",""]
[0,{"$f":"H243&\" \"&COUNTIFS($H$3:H243,H243)","v":" 0"},null,null,null,null,null,null,"",null,null,null,null,null,null,"","",""]
[0,{"$f":"H244&\" \"&COUNTIFS($H$3:H244,H244)","v":" 0"},null,null,null,null,null,null,"",null,null,null,null,null,null,"","",""]
[0,{"$f":"H245&\" \"&COUNTIFS($H$3:H245,H245)","v":" 0"},null,null,null,null,null,null,"",null,null,null,null,null,null,"","",""]
[0,{"$f":"H246&\" \"&COUNTIFS($H$3:H246,H246)","v":" 0"},null,null,null,null,null,null,"",null,null,null,null,null,null,"","",""]
[0,{"$f":"H247&\" \"&COUNTIFS($H$3:H247,H247)","v":" 0"},null,null,null,null,null,null,"",null,null,null,null,null,null,"","",""]
[0,{"$f":"H248&\" \"&COUNTIFS($H$3:H248,H248)","v":" 0"},null,null,null,null,null,null,"",null,null,null,null,null,null,"","",""]
[0,{"$f":"H249&\" \"&COUNTIFS($H$3:H249,H249)","v":" 0"},null,null,null,null,null,null,"",null,null,null,null,null,null,"","",""]
[0,{"$f":"H250&\" \"&COUNTIFS($H$3:H250,H250)","v":" 0"},null,null,null,null,null,null,"",null,null,null,null,null,null,"","",""]
[0,{"$f":"H251&\" \"&COUNTIFS($H$3:H251,H251)","v":" 0"},null,null,null,null,null,null,"",null,null,null,null,null,null,"","",""]
[0,{"$f":"H252&\" \"&COUNTIFS($H$3:H252,H252)","v":" 0"},null,null,null,null,null,null,"",null,null,null,null,null,null,"","",""]
[0,{"$f":"H253&\" \"&COUNTIFS($H$3:H253,H253)","v":" 0"},null,null,null,null,null,null,"",null,null,null,null,null,null,"","",""]
[0,{"$f":"H254&\" \"&COUNTIFS($H$3:H254,H254)","v":" 0"},null,null,null,null,null,null,"",null,null,null,null,null,null,"","",""]
[0,{"$f":"H255&\" \"&COUNTIFS($H$3:H255,H255)","v":" 0"},null,null,null,null,null,null,"",null,null,null,null,null,null,"","",""]
[0,{"$f":"H256&\" \"&COUNTIFS($H$3:H256,H256)","v":" 0"},null,null,null,null,null,null,"",null,null,null,null,null,null,"","",""]
[0,{"$f":"H257&\" \"&COUNTIFS($H$3:H257,H257)","v":" 0"},null,null,null,null,null,null,"",null,null,null,null,null,null,"","",""]
[0,{"$f":"H258&\" \"&COUNTIFS($H$3:H258,H258)","v":" 0"},null,null,null,null,null,null,"",null,null,null,null,null,null,"","",""]
[0,{"$f":"H259&\" \"&COUNTIFS($H$3:H259,H259)","v":" 0"},null,null,null,null,null,null,"",null,null,null,null,null,null,{"$f":"IFERROR(VLOOKUP(O259,DAFTAR_TOKO,2,FALSE),\"\")","v":""},{"$f":"IFERROR(VLOOKUP(O259,DAFTAR_TOKO,3,FALSE),\"\")","v":""},""]
[{"$f":"H260","v":0},{"$f":"H260&\" \"&COUNTIFS($H$3:H260,H260)","v":" 0"},null,null,null,null,null,null,{"$f":"IF(K260=\"\",\"\",L260/K260)","v":""},null,null,null,null,null,null,"","",{"$f":"IF(C260=\"\",\"\",C260)","v":""}]
[0,{"$f":"H261&\" \"&COUNTIFS($H$3:H261,H261)","v":" 0"},null,null,null,null,null,null,"",null,null,null,null,null,null,"","",""]
[0,{"$f":"H262&\" \"&COUNTIFS($H$3:H262,H262)","v":" 0"},null,null,null,null,null,null,"",null,null,null,null,null,null,"","",""]
[0,{"$f":"H263&\" \"&COUNTIFS($H$3:H263,H263)","v":" 0"},null,null,null,null,null,null,"",null,null,null,null,null,null,"","",""]
[0,{"$f":"H264&\" \"&COUNTIFS($H$3:H264,H264)","v":" 0"},null,null,null,null,null,null,"",null,null,null,null,null,null,"","",""]
[0,{"$f":"H265&\" \"&COUNTIFS($H$3:H265,H265)","v":" 0"},null,null,null,null,null,null,"",null,null,null,null,null,null,"","",""]
[0,{"$f":"H266&\" \"&COUNTIFS($H$3:H266,H266)","v":" 0"},null,null,null,null,null,null,"",null,null,null,null,null,null,"","",""]
[0,{"$f":"H267&\" \"&COUNTIFS($H$3:H267,H267)","v":" 0"},null,null,null,null,null,null,"",null,null,null,null,null,null,"","",""]
[0,{"$f":"H268&\" \"&COUNTIFS($H$3:H268,H268)","v":" 0"},null,null,null,null,null,null,"",null,null,null,null,null,null,"","",""]
[0,{"$f":"H269&\" \"&COUNTIFS($H$3:H269,H269)","v":" 0"},null,null,null,null,null,null,"",null,null,null,null,null,null,"","",""]
[0,{"$f":"H270&\" \"&COUNTIFS($H$3:H270,H270)","v":" 0"},null,null,null,null,null,null,"",null,null,null,null,null,null,"","",""]
[0,{"$f":"H271&\" \"&COUNTIFS($H$3:H271,H271)","v":" 0"},null,null,null,null,null,null,"",null,null,null,null,null,null,"","",""]
[0,{"$f":"H272&\" \"&COUNTIFS($H$3:H272,H272)","v":" 0"},null,null,null,null,null,null,"",null,null,null,null,null,null,"","",""]
[0,{"$f":"H273&\" \"&COUNTIFS($H$3:H273,H273)","v":" 0"},null,null,null,null,null,null,"",null,null,null,null,null,null,"","",""]
[0,{"$f":"H274&\" \"&COUNTIFS($H$3:H274,H274)","v":" 0"},null,null,null,null,null,null,"",null,null,null,null,null,null,"","",""]
[0,{"$f":"H275&\" \"&COUNTIFS($H$3:H275,H275)","v":" 0"},null,null,null,null,null,null,"",null,null,null,null,null,null,"","",""]
[0,{"$f":"H276&\" \"&COUNTIFS($H$3:H276,H276)","v":" 0"},null,null,null,null,null,null,"",null,null,null,null,null,null,"","",""]
[0,{"$f":"H277&\" \"&COUNTIFS($H$3:H277,H277)","v":" 0"},null,null,null,null,null,null,"",null,null,null,null,null,null,"","",""]
[0,{"$f":"H278&\" \"&COUNTIFS($H$3:H278,H278)","v":" 0"},null,null,null,null,null,null,"",null,null,null,null,null,null,"","",""]
[0,{"$f":"H279&\" \"&COUNTIFS($H$3:H279,H279)","v":" 0"},null,null,null,null,null,null,"",null,null,null,null,null,null,"","",""]
[0,{"$f":"H280&\" \"&COUNTIFS($H$3:H280,H280)","v":" 0"},null,null,null,null,null,null,"",null,null,null,null,null,null,"","",""]
[0,{"$f":"H281&\" \"&COUNTIFS($H$3:H281,H281)","v":" 0"},null,null,null,null,null,null,"",null,null,null,null,null,null,"","",""]
[0,{"$f":"H282&\" \"&COUNTIFS($H$3:H282,H282)","v":" 0"},null,null,null,null,null,null,"",null,null,null,null,null,null,"","",""]
[0,{"$f":"H283&\" \"&COUNTIFS($H$3:H283,H283)","v":" 0"},null,null,null,null,null,null,"",null,null,null,null,null,null,"","",""]
[0,{"$f":"H284&\" \"&COUNTIFS($H$3:H284,H284)","v":" 0"},null,null,null,null,null,null,"",null,null,null,null,null,null,"","",""]
[0,{"$f":"H285&\" \"&COUNTIFS($H$3:H285,H285)","v":" 0"},null,null,null,null,null,null,"",null,null,null,null,null,null,"","",""]
[0,{"$f":"H286&\" \"&COUNTIFS($H$3:H286,H286)","v":" 0"},null,null,null,null,null,null,"",null,null,null,null,null,null,"","",""]
[0,{"$f":"H287&\" \"&COUNTIFS($H$3:H287,H287)","v":" 0"},null,null,null,null,null,null,"",null,null,null,null,null,null,"","",""]
[0,{"$f":"H288&\" \"&COUNTIFS($H$3:H288,H288)","v":" 0"},null,null,null,null,null,null,"",null,null,null,null,null,null,"","",""]
[0,{"$f":"H289&\" \"&COUNTIFS($H$3:H289,H289)","v":" 0"},null,null,null,null,null,null,"",null,null,null,null,null,null,"","",""]
[0,{"$f":"H290&\" \"&COUNTIFS($H$3:H290,H290)","v":" 0"},null,null,null,null,null,null,"",null,null,null,null,null,null,"","",""]
[0,{"$f":"H291&\" \"&COUNTIFS($H$3:H291,H291)","v":" 0"},null,null,null,null,null,null,"",null,null,null,null,null,null,"","",""]
[0,{"$f":"H292&\" \"&COUNTIFS($H$3:H292,H292)","v":" 0"},null,null,null,null,null,null,"",null,null,null,null,null,null,"","",""]
[0,{"$f":"H293&\" \"&COUNTIFS($H$3:H293,H293)","v":" 0"},null,null,null,null,null,null,"",null,null,null,null,null,null,"","",""]
[0,{"$f":"H294&\" \"&COUNTIFS($H$3:H294,H294)","v":" 0"},null,null,null,null,null,null,"",null,null,null,null,null,null,"","",""]
[0,{"$f":"H295&\" \"&COUNTIFS($H$3:H295,H295)","v":" 0"},null,null,null,null,null,null,"",null,null,null,null,null,null,"","",""]
[0,{"$f":"H296&\" \"&COUNTIFS($H$3:H296,H296)","v":" 0"},null,null,null,null,null,null,"",null,null,null,null,null,null,"","",""]
[0,{"$f":"H297&\" \"&COUNTIFS($H$3:H297,H297)","v":" 0"},null,null,null,null,null,null,"",null,null,null,null,null,null,"","",""]
[0,{"$f":"H298&\" \"&COUNTIFS($H$3:H298,H298)","v":" 0"},null,null,null,null,null,null,"",null,null,null,null,null,null,"","",""]
[0,{"$f":"H299&\" \"&COUNTIFS($H$3:H299,H299)","v":" 0"},null,null,null,null,null,null,"",null,null,null,null,null,null,"","",""]
[0,{"$f":"H300&\" \"&COUNTIFS($H$3:H300,H300)","v":" 0"},null,null,null,null,null,null,"",null,null,null,null,null,null,"","",""]
[0,{"$f":"H301&\" \"&COUNTIFS($H$3:H301,H301)","v":" 0"},null,null,null,null,null,null,"",null,null,null,null,null,null,"","",""]
[0,{"$f":"H302&\" \"&COUNTIFS($H$3:H302,H302)","v":" 0"},null,null,null,null,null,null,"",null,null,null,null,null,null,"","",""]
[0,{"$f":"H303&\" \"&COUNTIFS($H$3:H303,H303)","v":" 0"},null,null,null,null,null,null,"",null,null,null,null,null,null,"","",""]
[0,{"$f":"H304&\" \"&COUNTIFS($H$3:H304,H304)","v":" 0"},null,null,null,null,null,null,"",null,null,null,null,null,null,"","",""]
[0,{"$f":"H305&\" \"&COUNTIFS($H$3:H305,H305)","v":" 0"},null,null,null,null,null,null,"",null,null,null,null,null,null,"","",""]
[0,{"$f":"H306&\" \"&COUNTIFS($H$3:H306,H306)","v":" 0"},null,null,null,null,null,null,"",null,null,null,null,null,null,"","",""]
[0,{"$f":"H307&\" \"&COUNTIFS($H$3:H307,H307)","v":" 0"},null,null,null,null,null,null,"",null,null,null,null,null,null,"","",""]
[0,{"$f":"H308&\" \"&COUNTIFS($H$3:H308,H308)","v":" 0"},null,null,null,null,null,null,"",null,null,null,null,null,null,"","",""]
[0,{"$f":"H309&\" \"&COUNTIFS($H$3:H309,H309)","v":" 0"},null,null,null,null,null,null,"",null,null,null,null,null,null,"","",""]
[0,{"$f":"H310&\" \"&COUNTIFS($H$3:H310,H310)","v":" 0"},null,null,null,null,null,null,"",null,null,null,null,null,null,"","",""]
[0,{"$f":"H311&\" \"&COUNTIFS($H$3:H311,H311)","v":" 0"},null,null,null,null,null,null,"",null,null,null,null,null,null,"","",""]
[0,{"$f":"H312&\" \"&COUNTIFS($H$3:H312,H312)","v":" 0"},null,null,null,null,null,null,"",null,null,null,null,null,null,"","",""]
[0,{"$f":"H313&\" \"&COUNTIFS($H$3:H313,H313)","v":" 0"},null,null,null,null,null,null,"",null,null,null,null,null,null,"","",""]
[0,{"$f":"H314&\" \"&COUNTIFS($H$3:H314,H314)","v":" 0"},null,null,null,null,null,null,"",null,null,null,null,null,null,"","",""]
[0,{"$f":"H315&\" \"&COUNTIFS($H$3:H315,H315)","v":" 0"},null,null,null,null,null,null,"",null,null,null,null,null,null,"","",""]
[0,{"$f":"H316&\" \"&COUNTIFS($H$3:H316,H316)","v":" 0"},null,null,null,null,null,null,"",null,null,null,null,null,null,"","",""]
[0,{"$f":"H317&\" \"&COUNTIFS($H$3:H317,H317)","v":" 0"},null,null,null,null,null,null,"",null,null,null,null,null,null,"","",""]
[0,{"$f":"H318&\" \"&COUNTIFS($H$3:H318,H318)","v":" 0"},null,null,null,null,null,null,"",null,null,null,null,null,null,"","",""]
[0,{"$f":"H319&\" \"&COUNTIFS($H$3:H319,H319)","v":" 0"},null,null,null,null,null,null,"",null,null,null,null,null,null,"","",""]
[0,{"$f":"H320&\" \"&COUNTIFS($H$3:H320,H320)","v":" 0"},null,null,null,null,null,null,"",null,null,null,null,null,null,"","",""]
[0,{"$f":"H321&\" \"&COUNTIFS($H$3:H321,H321)","v":" 0"},null,null,null,null,null,null,"",null,null,null,null,null,null,"","",""]
[0,{"$f":"H322&\" \"&COUNTIFS($H$3:H322,H322)","v":" 0"},null,null,null,null,null,null,"",null,null,null,null,null,null,"","",""]
[0,{"$f":"H323&\" \"&COUNTIFS($H$3:H323,H323)","v":" 0"},null,null,null,null,null,null,"",null,null,null,null,null,null,{"$f":"IFERROR(VLOOKUP(O323,DAFTAR_TOKO,2,FALSE),\"\")","v":""},{"$f":"IFERROR(VLOOKUP(O323,DAFTAR_TOKO,3,FALSE),\"\")","v":""},""]
[{"$f":"H324","v":0},{"$f":"H324&\" \"&COUNTIFS($H$3:H324,H324)","v":" 0"},null,null,null,null,null,null,{"$f":"IF(K324=\"\",\"\",L324/K324)","v":""},null,null,null,null,null,null,"","",{"$f":"IF(C324=\"\",\"\",C324)","v":""}]
[0,{"$f":"H325&\" \"&COUNTIFS($H$3:H325,H325)","v":" 0"},null,null,null,null,null,null,"",null,null,null,null,null,null,"","",""]
[0,{"$f":"H326&\" \"&COUNTIFS($H$3:H326,H326)","v":" 0"},null,null,null,null,null,null,"",null,null,null,null,null,null,"","",""]
[0,{"$f":"H327&\" \"&COUNTIFS($H$3:H327,H327)","v":" 0"},null,null,null,null,null,null,"",null,null,null,null,null,null,"","",""]
[0,{"$f":"H328&\" \"&COUNTIFS($H$3:H328,H328)","v":" 0"},null,null,null,null,null,null,"",null,null,null,null,null,null,"","",""]
[0,{"$f":"H329&\" \"&COUNTIFS($H$3:H329,H329)","v":" 0"},null,null,null,null,null,null,"",null,null,null,null,null,null,"","",""]
[0,{"$f":"H330&\" \"&COUNTIFS($H$3:H330,H330)","v":" 0"},null,null,null,null,null,null,"",null,null,null,null,null,null,"","",""]
[0,{"$f":"H331&\" \"&COUNTIFS($H$3:H331,H331)","v":" 0"},null,null,null,null,null,null,"",null,null,null,null,null,null,"","",""]
[0,{"$f":"H332&\" \"&COUNTIFS($H$3:H332,H332)","v":" 0"},null,null,null,null,null,null,"",null,null,null,null,null,null,"","",""]
[0,{"$f":"H333&\" \"&COUNTIFS($H$3:H333,H333)","v":" 0"},null,null,null,null,null,null,"",null,null,null,null,null,null,"","",""]
[0,{"$f":"H334&\" \"&COUNTIFS($H$3:H334,H334)","v":" 0"},null,null,null,null,null,null,"",null,null,null,null,null,null,"","",""]
[0,{"$f":"H335&\" \"&COUNTIFS($H$3:H335,H335)","v":" 0"},null,null,null,null,null,null,"",null,null,null,null,null,null,"","",""]
[0,{"$f":"H336&\" \"&COUNTIFS($H$3:H336,H336)","v":" 0"},null,null,null,null,null,null,"",null,null,null,null,null,null,"","",""]
[0,{"$f":"H337&\" \"&COUNTIFS($H$3:H337,H337)","v":" 0"},null,null,null,null,null,null,"",null,null,null,null,null,null,"","",""]
[0,{"$f":"H338&\" \"&COUNTIFS($H$3:H338,H338)","v":" 0"},null,null,null,null,null,null,"",null,null,null,null,null,null,"","",""]
[0,{"$f":"H339&\" \"&COUNTIFS($H$3:H339,H339)","v":" 0"},null,null,null,null,null,null,"",null,null,null,null,null,null,"","",""]
[0,{"$f":"H340&\" \"&COUNTIFS($H$3:H340,H340)","v":" 0"},null,null,null,null,null,null,"",null,null,null,null,null,null,"","",""]
[0,{"$f":"H341&\" \"&COUNTIFS($H$3:H341,H341)","v":" 0"},null,null,null,null,null,null,"",null,null,null,null,null,null,"","",""]
[0,{"$f":"H342&\" \"&COUNTIFS($H$3:H342,H342)","v":" 0"},null,null,null,null,null,null,"",null,null,null,null,null,null,"","",""]
[0,{"$f":"H343&\" \"&COUNTIFS($H$3:H343,H343)","v":" 0"},null,null,null,null,null,null,"",null,null,null,null,null,null,"","",""]
[0,{"$f":"H344&\" \"&COUNTIFS($H$3:H344,H344)","v":" 0"},null,null,null,null,null,null,"",null,null,null,null,null,null,"","",""]
[0,{"$f":"H345&\" \"&COUNTIFS($H$3:H345,H345)","v":" 0"},null,null,null,null,null,null,"",null,null,null,null,null,null,"","",""]
[0,{"$f":"H346&\" \"&COUNTIFS($H$3:H346,H346)","v":" 0"},null,null,null,null,null,null,"",null,null,null,null,null,null,"","",""]
[0,{"$f":"H347&\" \"&COUNTIFS($H$3:H347,H347)","v":" 0"},null,null,null,null,null,null,"",null,null,null,null,null,null,"","",""]
[0,{"$f":"H348&\" \"&COUNTIFS($H$3:H348,H348)","v":" 0"},null,null,null,null,null,null,"",null,null,null,null,null,null,"","",""]
[0,{"$f":"H349&\" \"&COUNTIFS($H$3:H349,H349)","v":" 0"},null,null,null,null,null,null,"",null,null,null,null,null,null,"","",""]
[0,{"$f":"H350&\" \"&COUNTIFS($H$3:H350,H350)","v":" 0"},null,null,null,null,null,null,"",null,null,null,null,null,null,"","",""]
[0,{"$f":"H351&\" \"&COUNTIFS($H$3:H351,H351)","v":" 0"},null,null,null,null,null,null,"",null,null,null,null,null,null,"","",""]
[0,{"$f":"H352&\" \"&COUNTIFS($H$3:H352,H352)","v":" 0"},null,null,null,null,null,null,"",null,null,null,null,null,null,"","",""]
[0,{"$f":"H353&\" \"&COUNTIFS($H$3:H353,H353)","v":" 0"},null,null,null,null,null,null,"",null,null,null,null,null,null,"","",""]
[0,{"$f":"H354&\" \"&COUNTIFS($H$3:H354,H354)","v":" 0"},null,null,null,null,null,null,"",null,null,null,null,null,null,"","",""]
[0,{"$f":"H355&\" \"&COUNTIFS($H$3:H355,H355)","v":" 0"},null,null,null,null,null,null,"",null,null,null,null,null,null,"","",""]
[0,{"$f":"H356&\" \"&COUNTIFS($H$3:H356,H356)","v":" 0"},null,null,null,null,null,null,"",null,null,null,null,null,null,"","",""]
[0,{"$f":"H357&\" \"&COUNTIFS($H$3:H357,H357)","v":" 0"},null,null,null,null,null,null,"",null,null,null,null,null,null,"","",""]
[0,{"$f":"H358&\" \"&COUNTIFS($H$3:H358,H358)","v":" 0"},null,null,null,null,null,null,"",null,null,null,null,null,null,"","",""]
[0,{"$f":"H359&\" \"&COUNTIFS($H$3:H359,H359)","v":" 0"},null,null,null,null,null,null,"",null,null,null,null,null,null,"","",""]
[0,{"$f":"H360&\" \"&COUNTIFS($H$3:H360,H360)","v":" 0"},null,null,null,null,null,null,"",null,null,null,null,null,null,"","",""]
[0,{"$f":"H361&\" \"&COUNTIFS($H$3:H361,H361)","v":" 0"},null,null,null,null,null,null,"",null,null,null,null,null,null,"","",""]
[0,{"$f":"H362&\" \"&COUNTIFS($H$3:H362,H362)","v":" 0"},null,null,null,null,null,null,"",null,null,null,null,null,null,"","",""]
[0,{"$f":"H363&\" \"&COUNTIFS($H$3:H363,H363)","v":" 0"},null,null,null,null,null,null,"",null,null,null,null,null,null,"","",""]
[0,{"$f":"H364&\" \"&COUNTIFS($H$3:H364,H364)","v":" 0"},null,null,null,null,null,null,"",null,null,null,null,null,null,"","",""]
[0,{"$f":"H365&\" \"&COUNTIFS($H$3:H365,H365)","v":" 0"},null,null,null,null,null,null,"",null,null,null,null,null,null,"","",""]
[0,{"$f":"H366&\" \"&COUNTIFS($H$3:H366,H366)","v":" 0"},null,null,null,null,null,null,"",null,null,null,null,null,null,"","",""]
[0,{"$f":"H367&\" \"&COUNTIFS($H$3:H367,H367)","v":" 0"},null,null,null,null,null,null,"",null,null,null,null,null,null,"","",""]
[0,{"$f":"H368&\" \"&COUNTIFS($H$3:H368,H368)","v":" 0"},null,null,null,null,null,null,"",null,null,null,null,null,null,"","",""]
[0,{"$f":"H369&\" \"&COUNTIFS($H$3:H369,H369)","v":" 0"},null,null,null,null,null,null,"",null,null,null,null,null,null,"","",""]
[0,{"$f":"H370&\" \"&COUNTIFS($H$3:H370,H370)","v":" 0"},null,null,null,null,null,null,"",null,null,null,null,null,null,"","",""]
[0,{"$f":"H371&\" \"&COUNTIFS($H$3:H371,H371)","v":" 0"},null,null,null,null,null,null,"",null,null,null,null,null,null,"","",""]
[0,{"$f":"H372&\" \"&COUNTIFS($H$3:H372,H372)","v":" 0"},null,null,null,null,null,null,"",null,null,null,null,null,null,"","",""]
[0,{"$f":"H373&\" \"&COUNTIFS($H$3:H373,H373)","v":" 0"},null,null,null,null,null,null,"",null,null,null,null,null,null,"","",""]
[0,{"$f":"H374&\" \"&COUNTIFS($H$3:H374,H374)","v":" 0"},null,null,null,null,null,null,"",null,null,null,null,null,null,"","",""]
[0,{"$f":"H375&\" \"&COUNTIFS($H$3:H375,H375)","v":" 0"},null,null,null,null,null,null,"",null,null,null,null,null,null,"","",""]
[0,{"$f":"H376&\" \"&COUNTIFS($H$3:H376,H376)","v":" 0"},null,null,null,null,null,null,"",null,null,null,null,null,null,"","",""]
[0,{"$f":"H377&\" \"&COUNTIFS($H$3:H377,H377)","v":" 0"},null,null,null,null,null,null,"",null,null,null,null,null,null,"","",""]
[0,{"$f":"H378&\" \"&COUNTIFS($H$3:H378,H378)","v":" 0"},null,null,null,null,null,null,"",null,null,null,null,null,null,"","",""]
[0,{"$f":"H379&\" \"&COUNTIFS($H$3:H379,H379)","v":" 0"},null,null,null,null,null,null,"",null,null,null,null,null,null,"","",""]
[0,{"$f":"H380&\" \"&COUNTIFS($H$3:H380,H380)","v":" 0"},null,null,null,null,null,null,"",null,null,null,null,null,null,"","",""]
[0,{"$f":"H381&\" \"&COUNTIFS($H$3:H381,H381)","v":" 0"},null,null,null,null,null,null,"",null,null,null,null,null,null,"","",""]
[0,{"$f":"H382&\" \"&COUNTIFS($H$3:H382,H382)","v":" 0"},null,null,null,null,null,null,"",null,null,null,null,null,null,"","",""]
[0,{"$f":"H383&\" \"&COUNTIFS($H$3:H383,H383)","v":" 0"},null,null,null,null,null,null,"",null,null,null,null,null,null,"","",""]
[0,{"$f":"H384&\" \"&COUNTIFS($H$3:H384,H384)","v":" 0"},null,null,null,null,null,null,"",null,null,null,null,null,null,"","",""]
[0,{"$f":"H385&\" \"&COUNTIFS($H$3:H385,H385)","v":" 0"},null,null,null,null,null,null,"",null,null,null,null,null,null,"","",""]
[0,{"$f":"H386&\" \"&COUNTIFS($H$3:H386,H386)","v":" 0"},null,null,null,null,null,null,"",null,null,null,null,null,null,"","",""]
[0,{"$f":"H387&\" \"&COUNTIFS($H$3:H387,H387)","v":" 0"},null,null,null,null,null,null,"",null,null,null,null,null,null,{"$f":"IFERROR(VLOOKUP(O387,DAFTAR_TOKO,2,FALSE),\"\")","v":""},{"$f":"IFERROR(VLOOKUP(O387,DAFTAR_TOKO,3,FALSE),\"\")","v":""},""]
[{"$f":"H388","v":0},{"$f":"H388&\" \"&COUNTIFS($H$3:H388,H388)","v":" 0"},null,null,null,null,null,null,{"$f":"IF(K388=\"\",\"\",L388/K388)","v":""},null,null,null,null,null,null,"","",{"$f":"IF(C388=\"\",\"\",C388)","v":""}]
[0,{"$f":"H389&\" \"&COUNTIFS($H$3:H389,H389)","v":" 0"},null,null,null,null,null,null,"",null,null,null,null,null,null,"","",""]
[0,{"$f":"H390&\" \"&COUNTIFS($H$3:H390,H390)","v":" 0"},null,null,null,null,null,null,"",null,null,null,null,null,null,"","",""]
[0,{"$f":"H391&\" \"&COUNTIFS($H$3:H391,H391)","v":" 0"},null,null,null,null,null,null,"",null,null,null,null,null,null,"","",""]
[0,{"$f":"H392&\" \"&COUNTIFS($H$3:H392,H392)","v":" 0"},null,null,null,null,null,null,"",null,null,null,null,null,null,"","",""]
[0,{"$f":"H393&\" \"&COUNTIFS($H$3:H393,H393)","v":" 0"},null,null,null,null,null,null,"",null,null,null,null,null,null,"","",""]
[0,{"$f":"H394&\" \"&COUNTIFS($H$3:H394,H394)","v":" 0"},null,null,null,null,null,null,"",null,null,null,null,null,null,"","",""]
[0,{"$f":"H395&\" \"&COUNTIFS($H$3:H395,H395)","v":" 0"},null,null,null,null,null,null,"",null,null,null,null,null,null,"","",""]
[0,{"$f":"H396&\" \"&COUNTIFS($H$3:H396,H396)","v":" 0"},null,null,null,null,null,null,"",null,null,null,null,null,null,"","",""]
[0,{"$f":"H397&\" \"&COUNTIFS($H$3:H397,H397)","v":" 0"},null,null,null,null,null,null,"",null,null,null,null,null,null,"","",""]
[0,{"$f":"H398&\" \"&COUNTIFS($H$3:H398,H398)","v":" 0"},null,null,null,null,null,null,"",null,null,null,null,null,null,"","",""]
[0,{"$f":"H399&\" \"&COUNTIFS($H$3:H399,H399)","v":" 0"},null,null,null,null,null,null,"",null,null,null,null,null,null,"","",""]
[0,{"$f":"H400&\" \"&COUNTIFS($H$3:H400,H400)","v":" 0"},null,null,null,null,null,null,"",null,null,null,null,null,null,"","",""]
[0,{"$f":"H401&\" \"&COUNTIFS($H$3:H401,H401)","v":" 0"},null,null,null,null,null,null,"",null,null,null,null,null,null,"","",""]
[0,{"$f":"H402&\" \"&COUNTIFS($H$3:H402,H402)","v":" 0"},null,null,null,null,null,null,"",null,null,null,null,null,null,"","",""]
[0,{"$f":"H403&\" \"&COUNTIFS($H$3:H403,H403)","v":" 0"},null,null,null,null,null,null,"",null,null,null,null,null,null,"","",""]
[0,{"$f":"H404&\" \"&COUNTIFS($H$3:H404,H404)","v":" 0"},null,null,null,null,null,null,"",null,null,null,null,null,null,"","",""]
[0,{"$f":"H405&\" \"&COUNTIFS($H$3:H405,H405)","v":" 0"},null,null,null,null,null,null,"",null,null,null,null,null,null,"","",""]
[0,{"$f":"H406&\" \"&COUNTIFS($H$3:H406,H406)","v":" 0"},null,null,null,null,null,null,"",null,null,null,null,null,null,"","",""]
[0,{"$f":"H407&\" \"&COUNTIFS($H$3:H407,H407)","v":" 0"},null,null,null,null,null,null,"",null,null,null,null,null,null,"","",""]
[0,{"$f":"H408&\" \"&COUNTIFS($H$3:H408,H408)","v":" 0"},null,null,null,null,null,null,"",null,null,null,null,null,null,"","",""]
[0,{"$f":"H409&\" \"&COUNTIFS($H$3:H409,H409)","v":" 0"},null,null,null,null,null,null,"",null,null,null,null,null,null,"","",""]
[0,{"$f":"H410&\" \"&COUNTIFS($H$3:H410,H410)","v":" 0"},null,null,null,null,null,null,"",null,null,null,null,null,null,"","",""]
[0,{"$f":"H411&\" \"&COUNTIFS($H$3:H411,H411)","v":" 0"},null,null,null,null,null,null,"",null,null,null,null,null,null,"","",""]
[0,{"$f":"H412&\" \"&COUNTIFS($H$3:H412,H412)","v":" 0"},null,null,null,null,null,null,"",null,null,null,null,null,null,"","",""]
[0,{"$f":"H413&\" \"&COUNTIFS($H$3:H413,H413)","v":" 0"},null,null,null,null,null,null,"",null,null,null,null,null,null,"","",""]
[0,{"$f":"H414&\" \"&COUNTIFS($H$3:H414,H414)","v":" 0"},null,null,null,null,null,null,"",null,null,null,null,null,null,"","",""]
[0,{"$f":"H415&\" \"&COUNTIFS($H$3:H415,H415)","v":" 0"},null,null,null,null,null,null,"",null,null,null,null,null,null,"","",""]
[0,{"$f":"H416&\" \"&COUNTIFS($H$3:H416,H416)","v":" 0"},null,null,null,null,null,null,"",null,null,null,null,null,null,"","",""]
[0,{"$f":"H417&\" \"&COUNTIFS($H$3:H417,H417)","v":" 0"},null,null,null,null,null,null,"",null,null,null,null,null,null,"","",""]
[0,{"$f":"H418&\" \"&COUNTIFS($H$3:H418,H418)","v":" 0"},null,null,null,null,null,null,"",null,null,null,null,null,null,"","",""]
[0,{"$f":"H419&\" \"&COUNTIFS($H$3:H419,H419)","v":" 0"},null,null,null,null,null,null,"",null,null,null,null,null,null,"","",""]
[0,{"$f":"H420&\" \"&COUNTIFS($H$3:H420,H420)","v":" 0"},null,null,null,null,null,null,"",null,null,null,null,null,null,"","",""]
[0,{"$f":"H421&\" \"&COUNTIFS($H$3:H421,H421)","v":" 0"},null,null,null,null,null,null,"",null,null,null,null,null,null,"","",""]
[0,{"$f":"H422&\" \"&COUNTIFS($H$3:H422,H422)","v":" 0"},null,null,null,null,null,null,"",null,null,null,null,null,null,"","",""]
[0,{"$f":"H423&\" \"&COUNTIFS($H$3:H423,H423)","v":" 0"},null,null,null,null,null,null,"",null,null,null,null,null,null,"","",""]
[0,{"$f":"H424&\" \"&COUNTIFS($H$3:H424,H424)","v":" 0"},null,null,null,null,null,null,"",null,null,null,null,null,null,"","",""]
[0,{"$f":"H425&\" \"&COUNTIFS($H$3:H425,H425)","v":" 0"},null,null,null,null,null,null,"",null,null,null,null,null,null,"","",""]
[0,{"$f":"H426&\" \"&COUNTIFS($H$3:H426,H426)","v":" 0"},null,null,null,null,null,null,"",null,null,null,null,null,null,"","",""]
[0,{"$f":"H427&\" \"&COUNTIFS($H$3:H427,H427)","v":" 0"},null,null,null,null,null,null,"",null,null,null,null,null,null,"","",""]
[0,{"$f":"H428&\" \"&COUNTIFS($H$3:H428,H428)","v":" 0"},null,null,null,null,null,null,"",null,null,null,null,null,null,"","",""]
[0,{"$f":"H429&\" \"&COUNTIFS($H$3:H429,H429)","v":" 0"},null,null,null,null,null,null,"",null,null,null,null,null,null,"","",""]
[0,{"$f":"H430&\" \"&COUNTIFS($H$3:H430,H430)","v":" 0"},null,null,null,null,null,null,"",null,null,null,null,null,null,"","",""]
[0,{"$f":"H431&\" \"&COUNTIFS($H$3:H431,H431)","v":" 0"},null,null,null,null,null,null,"",null,null,null,null,null,null,"","",""]
[0,{"$f":"H432&\" \"&COUNTIFS($H$3:H432,H432)","v":" 0"},null,null,null,null,null,null,"",null,null,null,null,null,null,"","",""]
[0,{"$f":"H433&\" \"&COUNTIFS($H$3:H433,H433)","v":" 0"},null,null,null,null,null,null,"",null,null,null,null,null,null,"","",""]
[0,{"$f":"H434&\" \"&COUNTIFS($H$3:H434,H434)","v":" 0"},null,null,null,null,null,null,"",null,null,null,null,null,null,"","",""]
[0,{"$f":"H435&\" \"&COUNTIFS($H$3:H435,H435)","v":" 0"},null,null,null,null,null,null,"",null,null,null,null,null,null,"","",""]
[0,{"$f":"H436&\" \"&COUNTIFS($H$3:H436,H436)","v":" 0"},null,null,null,null,null,null,"",null,null,null,null,null,null,"","",""]
[0,{"$f":"H437&\" \"&COUNTIFS($H$3:H437,H437)","v":" 0"},null,null,null,null,null,null,"",null,null,null,null,null,null,"","",""]
[0,{"$f":"H438&\" \"&COUNTIFS($H$3:H438,H438)","v":" 0"},null,null,null,null,null,null,"",null,null,null,null,null,null,"","",""]
[0,{"$f":"H439&\" \"&COUNTIFS($H$3:H439,H439)","v":" 0"},null,null,null,null,null,null,"",null,null,null,null,null,null,"","",""]
[0,{"$f":"H440&\" \"&COUNTIFS($H$3:H440,H440)","v":" 0"},null,null,null,null,null,null,"",null,null,null,null,null,null,"","",""]
[0,{"$f":"H441&\" \"&COUNTIFS($H$3:H441,H441)","v":" 0"},null,null,null,null,null,null,"",null,null,null,null,null,null,"","",""]
[0,{"$f":"H442&\" \"&COUNTIFS($H$3:H442,H442)","v":" 0"},null,null,null,null,null,null,"",null,null,null,null,null,null,"","",""]
[0,{"$f":"H443&\" \"&COUNTIFS($H$3:H443,H443)","v":" 0"},null,null,null,null,null,null,"",null,null,null,null,null,null,"","",""]
[0,{"$f":"H444&\" \"&COUNTIFS($H$3:H444,H444)","v":" 0"},null,null,null,null,null,null,"",null,null,null,null,null,null,"","",""]
[0,{"$f":"H445&\" \"&COUNTIFS($H$3:H445,H445)","v":" 0"},null,null,null,null,null,null,"",null,null,null,null,null,null,"","",""]
[0,{"$f":"H446&\" \"&COUNTIFS($H$3:H446,H446)","v":" 0"},null,null,null,null,null,null,"",null,null,null,null,null,null,"","",""]
[0,{"$f":"H447&\" \"&COUNTIFS($H$3:H447,H447)","v":" 0"},null,null,null,null,null,null,"",null,null,null,null,null,null,"","",""]
[0,{"$f":"H448&\" \"&COUNTIFS($H$3:H448,H448)","v":" 0"},null,null,null,null,null,null,"",null,null,null,null,null,null,"","",""]
[0,{"$f":"H449&\" \"&COUNTIFS($H$3:H449,H449)","v":" 0"},null,null,null,null,null,null,"",null,null,null,null,null,null,"","",""]
[0,{"$f":"H450&\" \"&COUNTIFS($H$3:H450,H450)","v":" 0"},null,null,null,null,null,null,"",null,null,null,null,null,null,"","",""]
[0,{"$f":"H451&\" \"&COUNTIFS($H$3:H451,H451)","v":" 0"},null,null,null,null,null,null,"",null,null,null,null,null,null,{"$f":"IFERROR(VLOOKUP(O451,DAFTAR_TOKO,2,FALSE),\"\")","v":""},{"$f":"IFERROR(VLOOKUP(O451,DAFTAR_TOKO,3,FALSE),\"\")","v":""},""]
[{"$f":"H452","v":0},{"$f":"H452&\" \"&COUNTIFS($H$3:H452,H452)","v":" 0"},null,null,null,null,null,null,{"$f":"IF(K452=\"\",\"\",L452/K452)","v":""},null,null,null,null,null,null,"","",{"$f":"IF(C452=\"\",\"\",C452)","v":""}]
[0,{"$f":"H453&\" \"&COUNTIFS($H$3:H453,H453)","v":" 0"},null,null,null,null,null,null,"",null,null,null,null,null,null,"","",""]
[0,{"$f":"H454&\" \"&COUNTIFS($H$3:H454,H454)","v":" 0"},null,null,null,null,null,null,"",null,null,null,null,null,null,"","",""]
[0,{"$f":"H455&\" \"&COUNTIFS($H$3:H455,H455)","v":" 0"},null,null,null,null,null,null,"",null,null,null,null,null,null,"","",""]
[0,{"$f":"H456&\" \"&COUNTIFS($H$3:H456,H456)","v":" 0"},null,null,null,null,null,null,"",null,null,null,null,null,null,"","",""]
[0,{"$f":"H457&\" \"&COUNTIFS($H$3:H457,H457)","v":" 0"},null,null,null,null,null,null,"",null,null,null,null,null,null,"","",""]
[0,{"$f":"H458&\" \"&COUNTIFS($H$3:H458,H458)","v":" 0"},null,null,null,null,null,null,"",null,null,null,null,null,null,"","",""]
[0,{"$f":"H459&\" \"&COUNTIFS($H$3:H459,H459)","v":" 0"},null,null,null,null,null,null,"",null,null,null,null,null,null,"","",""]
[0,{"$f":"H460&\" \"&COUNTIFS($H$3:H460,H460)","v":" 0"},null,null,null,null,null,null,"",null,null,null,null,null,null,"","",""]
[0,{"$f":"H461&\" \"&COUNTIFS($H$3:H461,H461)","v":" 0"},null,null,null,null,null,null,"",null,null,null,null,null,null,"","",""]
[0,{"$f":"H462&\" \"&COUNTIFS($H$3:H462,H462)","v":" 0"},null,null,null,null,null,null,"",null,null,null,null,null,null,"","",""]
[0,{"$f":"H463&\" \"&COUNTIFS($H$3:H463,H463)","v":" 0"},null,null,null,null,null,null,"",null,null,null,null,null,null,"","",""]
[0,{"$f":"H464&\" \"&COUNTIFS($H$3:H464,H464)","v":" 0"},null,null,null,null,null,null,"",null,null,null,null,null,null,"","",""]
[0,{"$f":"H465&\" \"&COUNTIFS($H$3:H465,H465)","v":" 0"},null,null,null,null,null,null,"",null,null,null,null,null,null,"","",""]
[0,{"$f":"H466&\" \"&COUNTIFS($H$3:H466,H466)","v":" 0"},null,null,null,null,null,null,"",null,null,null,null,null,null,"","",""]
[0,{"$f":"H467&\" \"&COUNTIFS($H$3:H467,H467)","v":" 0"},null,null,null,null,null,null,"",null,null,null,null,null,null,"","",""]
[0,{"$f":"H468&\" \"&COUNTIFS($H$3:H468,H468)","v":" 0"},null,null,null,null,null,null,"",null,null,null,null,null,null,"","",""]
[0,{"$f":"H469&\" \"&COUNTIFS($H$3:H469,H469)","v":" 0"},null,null,null,null,null,null,"",null,null,null,null,null,null,"","",""]
[0,{"$f":"H470&\" \"&COUNTIFS($H$3:H470,H470)","v":" 0"},null,null,null,null,null,null,"",null,null,null,null,null,null,"","",""]
[0,{"$f":"H471&\" \"&COUNTIFS($H$3:H471,H471)","v":" 0"},null,null,null,null,null,null,"",null,null,null,null,null,null,"","",""]
[0,{"$f":"H472&\" \"&COUNTIFS($H$3:H472,H472)","v":" 0"},null,null,null,null,null,null,"",null,null,null,null,null,null,"","",""]
[0,{"$f":"H473&\" \"&COUNTIFS($H$3:H473,H473)","v":" 0"},null,null,null,null,null,null,"",null,null,null,null,null,null,"","",""]
[0,{"$f":"H474&\" \"&COUNTIFS($H$3:H474,H474)","v":" 0"},null,null,null,null,null,null,"",null,null,null,null,null,null,"","",""]
[0,{"$f":"H475&\" \"&COUNTIFS($H$3:H475,H475)","v":" 0"},null,null,null,null,null,null,"",null,null,null,null,null,null,"","",""]
[0,{"$f":"H476&\" \"&COUNTIFS($H$3:H476,H476)","v":" 0"},null,null,null,null,null,null,"",null,null,null,null,null,null,"","",""]
[0,{"$f":"H477&\" \"&COUNTIFS($H$3:H477,H477)","v":" 0"},null,null,null,null,null,null,"",null,null,null,null,null,null,"","",""]
[0,{"$f":"H478&\" \"&COUNTIFS($H$3:H478,H478)","v":" 0"},null,null,null,null,null,null,"",null,null,null,null,null,null,"","",""]
[0,{"$f":"H479&\" \"&COUNTIFS($H$3:H479,H479)","v":" 0"},null,null,null,null,null,null,"",null,null,null,null,null,null,"","",""]
[0,{"$f":"H480&\" \"&COUNTIFS($H$3:H480,H480)","v":" 0"},null,null,null,null,null,null,"",null,null,null,null,null,null,"","",""]
[0,{"$f":"H481&\" \"&COUNTIFS($H$3:H481,H481)","v":" 0"},null,null,null,null,null,null,"",null,null,null,null,null,null,"","",""]
[0,{"$f":"H482&\" \"&COUNTIFS($H$3:H482,H482)","v":" 0"},null,null,null,null,null,null,"",null,null,null,null,null,null,"","",""]
[0,{"$f":"H483&\" \"&COUNTIFS($H$3:H483,H483)","v":" 0"},null,null,null,null,null,null,"",null,null,null,null,null,null,"","",""]
[0,{"$f":"H484&\" \"&COUNTIFS($H$3:H484,H484)","v":" 0"},null,null,null,null,null,null,"",null,null,null,null,null,null,"","",""]
[0,{"$f":"H485&\" \"&COUNTIFS($H$3:H485,H485)","v":" 0"},null,null,null,null,null,null,"",null,null,null,null,null,null,"","",""]
[0,{"$f":"H486&\" \"&COUNTIFS($H$3:H486,H486)","v":" 0"},null,null,null,null,null,null,"",null,null,null,null,null,null,"","",""]
[0,{"$f":"H487&\" \"&COUNTIFS($H$3:H487,H487)","v":" 0"},null,null,null,null,null,null,"",null,null,null,null,null,null,"","",""]
[0,{"$f":"H488&\" \"&COUNTIFS($H$3:H488,H488)","v":" 0"},null,null,null,null,null,null,"",null,null,null,null,null,null,"","",""]
[0,{"$f":"H489&\" \"&COUNTIFS($H$3:H489,H489)","v":" 0"},null,null,null,null,null,null,"",null,null,null,null,null,null,"","",""]
[0,{"$f":"H490&\" \"&COUNTIFS($H$3:H490,H490)","v":" 0"},null,null,null,null,null,null,"",null,null,null,null,null,null,"","",""]
[0,{"$f":"H491&\" \"&COUNTIFS($H$3:H491,H491)","v":" 0"},null,null,null,null,null,null,"",null,null,null,null,null,null,"","",""]
[0,{"$f":"H492&\" \"&COUNTIFS($H$3:H492,H492)","v":" 0"},null,null,null,null,null,null,"",null,null,null,null,null,null,"","",""]
[0,{"$f":"H493&\" \"&COUNTIFS($H$3:H493,H493)","v":" 0"},null,null,null,null,null,null,"",null,null,null,null,null,null,"","",""]
[0,{"$f":"H494&\" \"&COUNTIFS($H$3:H494,H494)","v":" 0"},null,null,null,null,null,null,"",null,null,null,null,null,null,"","",""]
[0,{"$f":"H495&\" \"&COUNTIFS($H$3:H495,H495)","v":" 0"},null,null,null,null,null,null,"",null,null,null,null,null,null,"","",""]
[0,{"$f":"H496&\" \"&COUNTIFS($H$3:H496,H496)","v":" 0"},null,null,null,null,null,null,"",null,null,null,null,null,null,"","",""]
[0,{"$f":"H497&\" \"&COUNTIFS($H$3:H497,H497)","v":" 0"},null,null,null,null,null,null,"",null,null,null,null,null,null,"","",""]
[0,{"$f":"H498&\" \"&COUNTIFS($H$3:H498,H498)","v":" 0"},null,null,null,null,null,null,"",null,null,null,null,null,null,"","",""]
[0,{"$f":"H499&\" \"&COUNTIFS($H$3:H499,H499)","v":" 0"},null,null,null,null,null,null,"",null,null,null,null,null,null,"","",""]
["END",{"$f":"H500&\" \"&COUNTIFS($H$3:H500,H500)","v":"END 1"},"END","END","END","END","END","END","END","END","END","END","END","END","END","end","end","end"]

{"sheet":"DATA LAMPIRAN","index":3,"n_rows":491,"n_cols":14,"rows_kept":491,"cut":false,"hidden":false,"merged":[]}
[]
[null,"NAMA TRANSAKSI","Perihal Surat dan Nomor Surat Undangan","Kegiatan (berdasarkan surat undangan)","NAMA","NIP","JABATAN","DASAR SURAT UNDANGAN","LOKASI","TANGGAL KEGIATAN","VOLUME","SATUAN","HARGA","TOTAL"]
[null,1,2,3,4,5,6,7,8,9,10,8,11,12]
[{"$f":"IFERROR(B4&\" \"&COUNTIFS($B$4:B4,B4),\"\")","v":"Transport rapat rutin KKKS 29 Mei 1"},"Transport rapat rutin KKKS 29 Mei","surat undangan rapat Korwil Noyan nomor: 420/76/Korwil-B","Rapat Koordinasi KKKS","Temari, S.Pd.",{"$f":"IFERROR(VLOOKUP(E4,data_guru,3,FALSE),\"\")","v":"53-004"},"Guru",null,"Kantor Hokage","2024-05-29",{"$f":"IFERROR(VLOOKUP(B4,data_kas3,3,FALSE),\"\")","v":1},{"$f":"IFERROR(VLOOKUP(B4,data_kas3,4,FALSE),\"\")","v":"orang/kegiatan"},{"$f":"IFERROR(VLOOKUP(B4,data_kas3,5,FALSE),\"\")","v":200000},{"$f":"IF(K4=\"\",\"\",K4*M4)","v":200000}]
[{"$f":"IFERROR(B5&\" \"&COUNTIFS($B$4:B5,B5),\"\")","v":"Transport rapat rutin KKKS 1"},"Transport rapat rutin KKKS","surat undangan rapat Korwil Noyan nomor: 420/66/Korwil-08 tanggal 6 Mei 2024","Rapat Koordinasi KKKS","Tenten, S.Pd.",0,"Guru",null,"Kantor Hokage","2024-05-08",{"$f":"IFERROR(VLOOKUP(B5,data_kas3,3,FALSE),\"\")","v":1},"orang/kegiatan",200000,200000]
[{"$f":"IFERROR(B6&\" \"&COUNTIFS($B$4:B6,B6),\"\")","v":"Transport kegiatan Kombel KKG Gugus 2 Sungai Dangin bulan Januari 1"},"Transport kegiatan Kombel KKG Gugus 2 Sungai Dangin bulan Januari","surat undangan rapat Kombel Gugus II Sungai Dangin nomor 422/12/SD.07/I/2024 tanggal 18 Januari 2024","Undangan Rapat Kombel Gugus II Sungai Dangin","Shikamaru, S.Pd.","012611","Kepala Sekolah",null,"Kantor Ninja Konoha","2024-01-20",1,"orang/kegiatan",150000,{"$f":"M6*K6","v":150000}]
[{"$f":"IFERROR(B7&\" \"&COUNTIFS($B$4:B7,B7),\"\")","v":"Transport kegiatan Kombel KKG Gugus 2 Sungai Dangin bulan Januari 2"},"Transport kegiatan Kombel KKG Gugus 2 Sungai Dangin bulan Januari","surat undangan rapat Kombel Gugus II Sungai Dangin nomor 422/12/SD.07/I/2024 tanggal 18 Januari 2025","Undangan Rapat Kombel Gugus II Sungai Dangin","Shikamaru, S.Pd.","012611","Guru",null,"Kantor Ninja Konoha","2024-01-20",1,"orang/kegiatan",150000,{"$f":"M7*K7","v":150000}]
[{"$f":"IFERROR(B8&\" \"&COUNTIFS($B$4:B8,B8),\"\")","v":"Transport kegiatan Kombel KKG Gugus 2 Sungai Dangin bulan Januari 3"},"Transport kegiatan Kombel KKG Gugus 2 Sungai Dangin bulan Januari","surat undangan rapat Kombel Gugus II Sungai Dangin nomor 422/12/SD.07/I/2024 tanggal 18 Januari 2026","Undangan Rapat Kombel Gugus II Sungai Dangin","Temari, S.Pd.","53-004","Guru",null,"Kantor Ninja Konoha","2024-01-20",1,"orang/kegiatan",150000,150000]
[{"$f":"IFERROR(B9&\" \"&COUNTIFS($B$4:B9,B9),\"\")","v":"Transport kegiatan Kombel KKG Gugus 2 Sungai Dangin bulan Januari 4"},"Transport kegiatan Kombel KKG Gugus 2 Sungai Dangin bulan Januari","surat undangan rapat Kombel Gugus II Sungai Dangin nomor 422/12/SD.07/I/2024 tanggal 18 Januari 2027","Undangan Rapat Kombel Gugus II Sungai Dangin","Tenten, S.Pd.",0,"Guru",null,"Kantor Ninja Konoha","2024-01-20",1,"orang/kegiatan",150000,150000]
[{"$f":"IFERROR(B10&\" \"&COUNTIFS($B$4:B10,B10),\"\")","v":"Transport kegiatan Kombel KKG Gugus 2 Sungai Dangin bulan Januari 5"},"Transport kegiatan Kombel KKG Gugus 2 Sungai Dangin bulan Januari","surat undangan rapat Kombel Gugus II Sungai Dangin nomor 422/12/SD.07/I/2024 tanggal 18 Januari 2028","Undangan Rapat Kombel Gugus II Sungai Dangin","Sakura, S.Pd.",0,"Guru",null,"Kantor Ninja Konoha","2024-01-20",1,"orang/kegiatan",150000,150000]
[{"$f":"IFERROR(B11&\" \"&COUNTIFS($B$4:B11,B11),\"\")","v":"Transport kegiatan Kombel KKG Gugus 2 Sungai Dangin bulan Januari 6"},"Transport kegiatan Kombel KKG Gugus 2 Sungai Dangin bulan Januari","surat undangan rapat Kombel Gugus II Sungai Dangin nomor 422/12/SD.07/I/2024 tanggal 18 Januari 2029","Undangan Rapat Kombel Gugus II Sungai Dangin","Kiba, S.Pd.",0,"Guru",null,"Kantor Ninja Konoha","2024-01-20",1,"orang/kegiatan",150000,150000]
[{"$f":"IFERROR(B12&\" \"&COUNTIFS($B$4:B12,B12),\"\")","v":"Transport kegiatan Kombel KKG Gugus 2 Sungai Dangin bulan Januari 7"},"Transport kegiatan Kombel KKG Gugus 2 Sungai Dangin bulan Januari","surat undangan rapat Kombel Gugus II Sungai Dangin nomor 422/12/SD.07/I/2024 tanggal 18 Januari 2030","Undangan Rapat Kombel Gugus II Sungai Dangin","Tenten, S.Pd.",0,"Guru",null,"Kantor Ninja Konoha","2024-01-20",1,"orang/kegiatan",150000,150000]
[{"$f":"IFERROR(B13&\" \"&COUNTIFS($B$4:B13,B13),\"\")","v":" 0"},null,null,null,null,"",null,null,null,{"$f":"IFERROR(VLOOKUP(B13,data_kas3,12,FALSE),\"\")","v":""},1,"","",{"$error":"#VALUE!"}]
[{"$f":"IFERROR(B14&\" \"&COUNTIFS($B$4:B14,B14),\"\")","v":" 0"},null,null,null,null,"",null,null,null,"",1,"","",{"$error":"#VALUE!"}]
[{"$f":"IFERROR(B15&\" \"&COUNTIFS($B$4:B15,B15),\"\")","v":" 0"},null,null,null,null,"",null,null,null,"",1,"","",{"$error":"#VALUE!"}]
[{"$f":"IFERROR(B16&\" \"&COUNTIFS($B$4:B16,B16),\"\")","v":" 0"},null,null,null,null,"",null,null,null,"",3,"","",{"$error":"#VALUE!"}]
[{"$f":"IFERROR(B17&\" \"&COUNTIFS($B$4:B17,B17),\"\")","v":" 0"},null,null,null,null,"",null,null,null,"",{"$f":"IFERROR(VLOOKUP(B17,data_kas3,3,FALSE),\"\")","v":""},"","",""]
[{"$f":"IFERROR(B18&\" \"&COUNTIFS($B$4:B18,B18),\"\")","v":" 0"},null,null,null,null,"",null,null,null,"","","","",""]
[{"$f":"IFERROR(B19&\" \"&COUNTIFS($B$4:B19,B19),\"\")","v":" 0"},null,null,null,null,"",null,"Nopry T. Tampubolon",null,"","",null,"",""]
[{"$f":"IFERROR(B20&\" \"&COUNTIFS($B$4:B20,B20),\"\")","v":" 0"},null,null,null,null,"",null,"Nopry T. Tampubolon",null,"","",null,"",""]
[{"$f":"IFERROR(B21&\" \"&COUNTIFS($B$4:B21,B21),\"\")","v":" 0"},null,null,null,null,"",null,"Belanja jasa tenaga administrasi sekolah",null,"","",null,"",""]
[{"$f":"IFERROR(B22&\" \"&COUNTIFS($B$4:B22,B22),\"\")","v":" 0"},null,null,null,null,"",null,"Belanja jasa tenaga administrasi sekolah",null,"","",null,"",""]
[{"$f":"IFERROR(B23&\" \"&COUNTIFS($B$4:B23,B23),\"\")","v":" 0"},null,null,null,null,"",null,"Upah petugas kebersihan",null,"","",null,"",""]
[{"$f":"IFERROR(B24&\" \"&COUNTIFS($B$4:B24,B24),\"\")","v":" 0"},null,null,null,null,"",null,"Upah petugas kebersihan",null,"","",null,"",""]
[{"$f":"IFERROR(B25&\" \"&COUNTIFS($B$4:B25,B25),\"\")","v":" 0"},null,null,null,null,"",null,"Paket / Kuota Internet",null,"","",null,"",""]
[{"$f":"IFERROR(B26&\" \"&COUNTIFS($B$4:B26,B26),\"\")","v":" 0"},null,null,null,null,"",null,"Paket / Kuota Internet",null,"","",null,"",""]
[{"$f":"IFERROR(B27&\" \"&COUNTIFS($B$4:B27,B27),\"\")","v":" 0"},null,null,null,null,"",null,"Belanja Perjalanan Dinas Dalam Kota (Ty.Hilir,Balai,Ty.Hulu,Meliau,Kembayan,Beduai, Sekayam,Entiong,Bonti)-Pejabat Pelaksana Golongan I : Uang Transportasi PP",null,"","",null,"",""]
[{"$f":"IFERROR(B28&\" \"&COUNTIFS($B$4:B28,B28),\"\")","v":" 0"},null,null,null,null,"",null,"Belanja Perjalanan Dinas Dalam Kota (Ty.Hilir,Balai,Ty.Hulu,Meliau,Kembayan,Beduai, Sekayam,Entiong,Bonti)-Pejabat Pelaksana Golongan I : Uang Transportasi PP",null,"","",null,"",""]
[{"$f":"IFERROR(B29&\" \"&COUNTIFS($B$4:B29,B29),\"\")","v":" 0"},null,null,null,null,"",null,"Belanja Perjalanan Dinas Dalam Kota (Ty.Hilir,Balai,Ty.Hulu,Meliau,Kembayan,Beduai, Sekayam,Entiong,Bonti)-Pejabat Pengawas / Pejabat Fungsional Ahli Muda / Pejabat Pelaksana Golongan IV : Uang Harian",null,"","",null,"",""]
[{"$f":"IFERROR(B30&\" \"&COUNTIFS($B$4:B30,B30),\"\")","v":" 0"},null,null,null,null,"",null,null,null,"","","","",""]
[{"$f":"IFERROR(B31&\" \"&COUNTIFS($B$4:B31,B31),\"\")","v":" 0"},null,null,null,null,"",null,null,null,"","","","",""]
[{"$f":"IFERROR(B32&\" \"&COUNTIFS($B$4:B32,B32),\"\")","v":" 0"},null,null,null,null,"",null,null,null,"","","","",""]
[{"$f":"IFERROR(B33&\" \"&COUNTIFS($B$4:B33,B33),\"\")","v":" 0"},null,null,null,null,"",null,null,null,{"$f":"IFERROR(VLOOKUP(B33,data_kas3,12,FALSE),\"\")","v":""},{"$f":"IFERROR(VLOOKUP(B33,data_kas3,3,FALSE),\"\")","v":""},"",{"$f":"IFERROR(VLOOKUP(B33,data_kas3,5,FALSE),\"\")","v":""},{"$f":"IF(K33=\"\",\"\",K33*M33)","v":""}]
[{"$f":"IFERROR(B34&\" \"&COUNTIFS($B$4:B34,B34),\"\")","v":" 0"},null,null,null,null,"",null,null,null,"","","","",""]
[{"$f":"IFERROR(B35&\" \"&COUNTIFS($B$4:B35,B35),\"\")","v":" 0"},null,null,null,null,"",null,null,null,"","","","",""]
[{"$f":"IFERROR(B36&\" \"&COUNTIFS($B$4:B36,B36),\"\")","v":" 0"},null,null,null,null,"",null,null,null,"","","","",""]
[{"$f":"IFERROR(B37&\" \"&COUNTIFS($B$4:B37,B37),\"\")","v":" 0"},null,null,null,null,"",null,null,null,"","","","",""]
[{"$f":"IFERROR(B38&\" \"&COUNTIFS($B$4:B38,B38),\"\")","v":" 0"},null,null,null,null,"",null,null,null,"","","","",""]
[{"$f":"IFERROR(B39&\" \"&COUNTIFS($B$4:B39,B39),\"\")","v":" 0"},null,null,null,null,"",null,null,null,"","","","",""]
[{"$f":"IFERROR(B40&\" \"&COUNTIFS($B$4:B40,B40),\"\")","v":" 0"},null,null,null,null,"",null,null,null,"","","","",""]
[{"$f":"IFERROR(B41&\" \"&COUNTIFS($B$4:B41,B41),\"\")","v":" 0"},null,null,null,null,"",null,null,null,"","","","",""]
[{"$f":"IFERROR(B42&\" \"&COUNTIFS($B$4:B42,B42),\"\")","v":" 0"},null,null,null,null,"",null,null,null,"","","","",""]
[{"$f":"IFERROR(B43&\" \"&COUNTIFS($B$4:B43,B43),\"\")","v":" 0"},null,null,null,null,"",null,null,null,"","","","",""]
[{"$f":"IFERROR(B44&\" \"&COUNTIFS($B$4:B44,B44),\"\")","v":" 0"},null,null,null,null,"",null,null,null,"","","","",""]
[{"$f":"IFERROR(B45&\" \"&COUNTIFS($B$4:B45,B45),\"\")","v":" 0"},null,null,null,null,"",null,null,null,"","","","",""]
[{"$f":"IFERROR(B46&\" \"&COUNTIFS($B$4:B46,B46),\"\")","v":" 0"},null,null,null,null,"",null,null,null,"","","","",""]
[{"$f":"IFERROR(B47&\" \"&COUNTIFS($B$4:B47,B47),\"\")","v":" 0"},null,null,null,null,"",null,null,null,"","","","",""]
[{"$f":"IFERROR(B48&\" \"&COUNTIFS($B$4:B48,B48),\"\")","v":" 0"},null,null,null,null,"",null,null,null,"","","","",""]
[{"$f":"IFERROR(B49&\" \"&COUNTIFS($B$4:B49,B49),\"\")","v":" 0"},null,null,null,null,"",null,null,null,"","","","",""]
[{"$f":"IFERROR(B50&\" \"&COUNTIFS($B$4:B50,B50),\"\")","v":" 0"},null,null,null,null,"",null,null,null,"","","","",""]
[{"$f":"IFERROR(B51&\" \"&COUNTIFS($B$4:B51,B51),\"\")","v":" 0"},null,null,null,null,"",null,null,null,"","","","",""]
[{"$f":"IFERROR(B52&\" \"&COUNTIFS($B$4:B52,B52),\"\")","v":" 0"},null,null,null,null,"",null,null,null,"","","","",""]
[{"$f":"IFERROR(B53&\" \"&COUNTIFS($B$4:B53,B53),\"\")","v":" 0"},null,null,null,null,"",null,null,null,"","","","",""]
[{"$f":"IFERROR(B54&\" \"&COUNTIFS($B$4:B54,B54),\"\")","v":" 0"},null,null,null,null,"",null,null,null,"","","","",""]
[{"$f":"IFERROR(B55&\" \"&COUNTIFS($B$4:B55,B55),\"\")","v":" 0"},null,null,null,null,"",null,null,null,"","","","",""]
[{"$f":"IFERROR(B56&\" \"&COUNTIFS($B$4:B56,B56),\"\")","v":" 0"},null,null,null,null,"",null,null,null,"","","","",""]
[{"$f":"IFERROR(B57&\" \"&COUNTIFS($B$4:B57,B57),\"\")","v":" 0"},null,null,null,null,"",null,null,null,"","","","",""]
[{"$f":"IFERROR(B58&\" \"&COUNTIFS($B$4:B58,B58),\"\")","v":" 0"},null,null,null,null,"",null,null,null,"","","","",""]
[{"$f":"IFERROR(B59&\" \"&COUNTIFS($B$4:B59,B59),\"\")","v":" 0"},null,null,null,null,"",null,null,null,{"$f":"IFERROR(VLOOKUP(B59,data_kas3,12,FALSE),\"\")","v":""},{"$f":"IFERROR(VLOOKUP(B59,data_kas3,3,FALSE),\"\")","v":""},"",{"$f":"IFERROR(VLOOKUP(B59,data_kas3,5,FALSE),\"\")","v":""},""]
[{"$f":"IFERROR(B60&\" \"&COUNTIFS($B$4:B60,B60),\"\")","v":" 0"},null,null,null,null,"",null,null,null,"","","","",{"$f":"IF(K60=\"\",\"\",K60*M60)","v":""}]
[{"$f":"IFERROR(B61&\" \"&COUNTIFS($B$4:B61,B61),\"\")","v":" 0"},null,null,null,null,"",null,null,null,"","","","",""]
[{"$f":"IFERROR(B62&\" \"&COUNTIFS($B$4:B62,B62),\"\")","v":" 0"},null,null,null,null,"",null,null,null,"","","","",""]
[{"$f":"IFERROR(B63&\" \"&COUNTIFS($B$4:B63,B63),\"\")","v":" 0"},null,null,null,null,"",null,null,null,"","","","",""]
[{"$f":"IFERROR(B64&\" \"&COUNTIFS($B$4:B64,B64),\"\")","v":" 0"},null,null,null,null,"",null,null,null,"","","","",""]
[{"$f":"IFERROR(B65&\" \"&COUNTIFS($B$4:B65,B65),\"\")","v":" 0"},null,null,null,null,"",null,null,null,"","","","",""]
[{"$f":"IFERROR(B66&\" \"&COUNTIFS($B$4:B66,B66),\"\")","v":" 0"},null,null,null,null,"",null,null,null,"","","","",""]
[{"$f":"IFERROR(B67&\" \"&COUNTIFS($B$4:B67,B67),\"\")","v":" 0"},null,null,null,null,"",null,null,null,"","","","",""]
[{"$f":"IFERROR(B68&\" \"&COUNTIFS($B$4:B68,B68),\"\")","v":" 0"},null,null,null,null,{"$f":"IFERROR(VLOOKUP(E68,data_guru,3,FALSE),\"\")","v":""},null,null,null,"","",{"$f":"IFERROR(VLOOKUP(B68,data_kas3,4,FALSE),\"\")","v":""},"",""]
[{"$f":"IFERROR(B69&\" \"&COUNTIFS($B$4:B69,B69),\"\")","v":" 0"},null,null,null,null,"",null,null,null,"","","","",""]
[{"$f":"IFERROR(B70&\" \"&COUNTIFS($B$4:B70,B70),\"\")","v":" 0"},null,null,null,null,"",null,null,null,"","","","",""]
[{"$f":"IFERROR(B71&\" \"&COUNTIFS($B$4:B71,B71),\"\")","v":" 0"},null,null,null,null,"",null,null,null,"","","","",""]
[{"$f":"IFERROR(B72&\" \"&COUNTIFS($B$4:B72,B72),\"\")","v":" 0"},null,null,null,null,"",null,null,null,"","","","",""]
[{"$f":"IFERROR(B73&\" \"&COUNTIFS($B$4:B73,B73),\"\")","v":" 0"},null,null,null,null,"",null,null,null,"","","","",""]
[{"$f":"IFERROR(B74&\" \"&COUNTIFS($B$4:B74,B74),\"\")","v":" 0"},null,null,null,null,"",null,null,null,"","","","",""]
[{"$f":"IFERROR(B75&\" \"&COUNTIFS($B$4:B75,B75),\"\")","v":" 0"},null,null,null,null,"",null,null,null,"","","","",""]
[{"$f":"IFERROR(B76&\" \"&COUNTIFS($B$4:B76,B76),\"\")","v":" 0"},null,null,null,null,"",null,null,null,"","","","",""]
[{"$f":"IFERROR(B77&\" \"&COUNTIFS($B$4:B77,B77),\"\")","v":" 0"},null,null,null,null,"",null,null,null,"","","","",""]
[{"$f":"IFERROR(B78&\" \"&COUNTIFS($B$4:B78,B78),\"\")","v":" 0"},null,null,null,null,"",null,null,null,"","","","",""]
[{"$f":"IFERROR(B79&\" \"&COUNTIFS($B$4:B79,B79),\"\")","v":" 0"},null,null,null,null,"",null,null,null,"","","","",""]
[{"$f":"IFERROR(B80&\" \"&COUNTIFS($B$4:B80,B80),\"\")","v":" 0"},null,null,null,null,"",null,null,null,"","","","",""]
[{"$f":"IFERROR(B81&\" \"&COUNTIFS($B$4:B81,B81),\"\")","v":" 0"},null,null,null,null,"",null,null,null,"","","","",""]
[{"$f":"IFERROR(B82&\" \"&COUNTIFS($B$4:B82,B82),\"\")","v":" 0"},null,null,null,null,"",null,null,null,"","","","",""]
[{"$f":"IFERROR(B83&\" \"&COUNTIFS($B$4:B83,B83),\"\")","v":" 0"},null,null,null,null,"",null,null,null,"","","","",""]
[{"$f":"IFERROR(B84&\" \"&COUNTIFS($B$4:B84,B84),\"\")","v":" 0"},null,null,null,null,"",null,null,null,"","","","",""]
[{"$f":"IFERROR(B85&\" \"&COUNTIFS($B$4:B85,B85),\"\")","v":" 0"},null,null,null,null,"",null,null,null,"","","","",""]
[{"$f":"IFERROR(B86&\" \"&COUNTIFS($B$4:B86,B86),\"\")","v":" 0"},null,null,null,null,"",null,null,null,"","","","",""]
[{"$f":"IFERROR(B87&\" \"&COUNTIFS($B$4:B87,B87),\"\")","v":" 0"},null,null,null,null,"",null,null,null,"","","","",""]
[{"$f":"IFERROR(B88&\" \"&COUNTIFS($B$4:B88,B88),\"\")","v":" 0"},null,null,null,null,"",null,null,null,"","","","",""]
[{"$f":"IFERROR(B89&\" \"&COUNTIFS($B$4:B89,B89),\"\")","v":" 0"},null,null,null,null,"",null,null,null,"","","","",""]
[{"$f":"IFERROR(B90&\" \"&COUNTIFS($B$4:B90,B90),\"\")","v":" 0"},null,null,null,null,"",null,null,null,"","","","",""]
[{"$f":"IFERROR(B91&\" \"&COUNTIFS($B$4:B91,B91),\"\")","v":" 0"},null,null,null,null,"",null,null,null,"","","","",""]
[{"$f":"IFERROR(B92&\" \"&COUNTIFS($B$4:B92,B92),\"\")","v":" 0"},null,null,null,null,"",null,null,null,"","","","",""]
[{"$f":"IFERROR(B93&\" \"&COUNTIFS($B$4:B93,B93),\"\")","v":" 0"},null,null,null,null,"",null,null,null,"","","","",""]
[{"$f":"IFERROR(B94&\" \"&COUNTIFS($B$4:B94,B94),\"\")","v":" 0"},null,null,null,null,"",null,null,null,"","","","",""]
[{"$f":"IFERROR(B95&\" \"&COUNTIFS($B$4:B95,B95),\"\")","v":" 0"},null,null,null,null,"",null,null,null,"","","","",""]
[{"$f":"IFERROR(B96&\" \"&COUNTIFS($B$4:B96,B96),\"\")","v":" 0"},null,null,null,null,"",null,null,null,"","","","",""]
[{"$f":"IFERROR(B97&\" \"&COUNTIFS($B$4:B97,B97),\"\")","v":" 0"},null,null,null,null,"",null,null,null,"","","","",""]
[{"$f":"IFERROR(B98&\" \"&COUNTIFS($B$4:B98,B98),\"\")","v":" 0"},null,null,null,null,"",null,null,null,"","","","",""]
[{"$f":"IFERROR(B99&\" \"&COUNTIFS($B$4:B99,B99),\"\")","v":" 0"},null,null,null,null,"",null,null,null,"","","","",""]
[{"$f":"IFERROR(B100&\" \"&COUNTIFS($B$4:B100,B100),\"\")","v":" 0"},null,null,null,null,"",null,null,null,"","","","",""]
[{"$f":"IFERROR(B101&\" \"&COUNTIFS($B$4:B101,B101),\"\")","v":" 0"},null,null,null,null,"",null,null,null,"","","","",""]
[{"$f":"IFERROR(B102&\" \"&COUNTIFS($B$4:B102,B102),\"\")","v":" 0"},null,null,null,null,"",null,null,null,"","","","",""]
[{"$f":"IFERROR(B103&\" \"&COUNTIFS($B$4:B103,B103),\"\")","v":" 0"},null,null,null,null,"",null,null,null,"","","","",""]
[{"$f":"IFERROR(B104&\" \"&COUNTIFS($B$4:B104,B104),\"\")","v":" 0"},null,null,null,null,"",null,null,null,"","","","",""]
[{"$f":"IFERROR(B105&\" \"&COUNTIFS($B$4:B105,B105),\"\")","v":" 0"},null,null,null,null,"",null,null,null,"","","","",""]
[{"$f":"IFERROR(B106&\" \"&COUNTIFS($B$4:B106,B106),\"\")","v":" 0"},null,null,null,null,"",null,null,null,"","","","",""]
[{"$f":"IFERROR(B107&\" \"&COUNTIFS($B$4:B107,B107),\"\")","v":" 0"},null,null,null,null,"",null,null,null,"","","","",""]
[{"$f":"IFERROR(B108&\" \"&COUNTIFS($B$4:B108,B108),\"\")","v":" 0"},null,null,null,null,"",null,null,null,"","","","",""]
[{"$f":"IFERROR(B109&\" \"&COUNTIFS($B$4:B109,B109),\"\")","v":" 0"},null,null,null,null,"",null,null,null,"","","","",""]
[{"$f":"IFERROR(B110&\" \"&COUNTIFS($B$4:B110,B110),\"\")","v":" 0"},null,null,null,null,"",null,null,null,"","","","",""]
[{"$f":"IFERROR(B111&\" \"&COUNTIFS($B$4:B111,B111),\"\")","v":" 0"},null,null,null,null,"",null,null,null,"","","","",""]
[{"$f":"IFERROR(B112&\" \"&COUNTIFS($B$4:B112,B112),\"\")","v":" 0"},null,null,null,null,"",null,null,null,"","","","",""]
[{"$f":"IFERROR(B113&\" \"&COUNTIFS($B$4:B113,B113),\"\")","v":" 0"},null,null,null,null,"",null,null,null,"","","","",""]
[{"$f":"IFERROR(B114&\" \"&COUNTIFS($B$4:B114,B114),\"\")","v":" 0"},null,null,null,null,"",null,null,null,"","","","",""]
[{"$f":"IFERROR(B115&\" \"&COUNTIFS($B$4:B115,B115),\"\")","v":" 0"},null,null,null,null,"",null,null,null,"","","","",""]
[{"$f":"IFERROR(B116&\" \"&COUNTIFS($B$4:B116,B116),\"\")","v":" 0"},null,null,null,null,"",null,null,null,"","","","",""]
[{"$f":"IFERROR(B117&\" \"&COUNTIFS($B$4:B117,B117),\"\")","v":" 0"},null,null,null,null,"",null,null,null,"","","","",""]
[{"$f":"IFERROR(B118&\" \"&COUNTIFS($B$4:B118,B118),\"\")","v":" 0"},null,null,null,null,"",null,null,null,"","","","",""]
[{"$f":"IFERROR(B119&\" \"&COUNTIFS($B$4:B119,B119),\"\")","v":" 0"},null,null,null,null,"",null,null,null,"","","","",""]
[{"$f":"IFERROR(B120&\" \"&COUNTIFS($B$4:B120,B120),\"\")","v":" 0"},null,null,null,null,"",null,null,null,"","","","",""]
[{"$f":"IFERROR(B121&\" \"&COUNTIFS($B$4:B121,B121),\"\")","v":" 0"},null,null,null,null,"",null,null,null,"","","","",""]
[{"$f":"IFERROR(B122&\" \"&COUNTIFS($B$4:B122,B122),\"\")","v":" 0"},null,null,null,null,"",null,null,null,"","","","",""]
[{"$f":"IFERROR(B123&\" \"&COUNTIFS($B$4:B123,B123),\"\")","v":" 0"},null,null,null,null,"",null,null,null,{"$f":"IFERROR(VLOOKUP(B123,data_kas3,12,FALSE),\"\")","v":""},{"$f":"IFERROR(VLOOKUP(B123,data_kas3,3,FALSE),\"\")","v":""},"",{"$f":"IFERROR(VLOOKUP(B123,data_kas3,5,FALSE),\"\")","v":""},""]
[{"$f":"IFERROR(B124&\" \"&COUNTIFS($B$4:B124,B124),\"\")","v":" 0"},null,null,null,null,"",null,null,null,"","","","",{"$f":"IF(K124=\"\",\"\",K124*M124)","v":""}]
[{"$f":"IFERROR(B125&\" \"&COUNTIFS($B$4:B125,B125),\"\")","v":" 0"},null,null,null,null,"",null,null,null,"","","","",""]
[{"$f":"IFERROR(B126&\" \"&COUNTIFS($B$4:B126,B126),\"\")","v":" 0"},null,null,null,null,"",null,null,null,"","","","",""]
[{"$f":"IFERROR(B127&\" \"&COUNTIFS($B$4:B127,B127),\"\")","v":" 0"},null,null,null,null,"",null,null,null,"","","","",""]
[{"$f":"IFERROR(B128&\" \"&COUNTIFS($B$4:B128,B128),\"\")","v":" 0"},null,null,null,null,"",null,null,null,"","","","",""]
[{"$f":"IFERROR(B129&\" \"&COUNTIFS($B$4:B129,B129),\"\")","v":" 0"},null,null,null,null,"",null,null,null,"","","","",""]
[{"$f":"IFERROR(B130&\" \"&COUNTIFS($B$4:B130,B130),\"\")","v":" 0"},null,null,null,null,"",null,null,null,"","","","",""]
[{"$f":"IFERROR(B131&\" \"&COUNTIFS($B$4:B131,B131),\"\")","v":" 0"},null,null,null,null,"",null,null,null,"","","","",""]
[{"$f":"IFERROR(B132&\" \"&COUNTIFS($B$4:B132,B132),\"\")","v":" 0"},null,null,null,null,{"$f":"IFERROR(VLOOKUP(E132,data_guru,3,FALSE),\"\")","v":""},null,null,null,"","",{"$f":"IFERROR(VLOOKUP(B132,data_kas3,4,FALSE),\"\")","v":""},"",""]
[{"$f":"IFERROR(B133&\" \"&COUNTIFS($B$4:B133,B133),\"\")","v":" 0"},null,null,null,null,"",null,null,null,"","","","",""]
[{"$f":"IFERROR(B134&\" \"&COUNTIFS($B$4:B134,B134),\"\")","v":" 0"},null,null,null,null,"",null,null,null,"","","","",""]
[{"$f":"IFERROR(B135&\" \"&COUNTIFS($B$4:B135,B135),\"\")","v":" 0"},null,null,null,null,"",null,null,null,"","","","",""]
[{"$f":"IFERROR(B136&\" \"&COUNTIFS($B$4:B136,B136),\"\")","v":" 0"},null,null,null,null,"",null,null,null,"","","","",""]
[{"$f":"IFERROR(B137&\" \"&COUNTIFS($B$4:B137,B137),\"\")","v":" 0"},null,null,null,null,"",null,null,null,"","","","",""]
[{"$f":"IFERROR(B138&\" \"&COUNTIFS($B$4:B138,B138),\"\")","v":" 0"},null,null,null,null,"",null,null,null,"","","","",""]
[{"$f":"IFERROR(B139&\" \"&COUNTIFS($B$4:B139,B139),\"\")","v":" 0"},null,null,null,null,"",null,null,null,"","","","",""]
[{"$f":"IFERROR(B140&\" \"&COUNTIFS($B$4:B140,B140),\"\")","v":" 0"},null,null,null,null,"",null,null,null,"","","","",""]
[{"$f":"IFERROR(B141&\" \"&COUNTIFS($B$4:B141,B141),\"\")","v":" 0"},null,null,null,null,"",null,null,null,"","","","",""]
[{"$f":"IFERROR(B142&\" \"&COUNTIFS($B$4:B142,B142),\"\")","v":" 0"},null,null,null,null,"",null,null,null,"","","","",""]
[{"$f":"IFERROR(B143&\" \"&COUNTIFS($B$4:B143,B143),\"\")","v":" 0"},null,null,null,null,"",null,null,null,"","","","",""]
[{"$f":"IFERROR(B144&\" \"&COUNTIFS($B$4:B144,B144),\"\")","v":" 0"},null,null,null,null,"",null,null,null,"","","","",""]
[{"$f":"IFERROR(B145&\" \"&COUNTIFS($B$4:B145,B145),\"\")","v":" 0"},null,null,null,null,"",null,null,null,"","","","",""]
[{"$f":"IFERROR(B146&\" \"&COUNTIFS($B$4:B146,B146),\"\")","v":" 0"},null,null,null,null,"",null,null,null,"","","","",""]
[{"$f":"IFERROR(B147&\" \"&COUNTIFS($B$4:B147,B147),\"\")","v":" 0"},null,null,null,null,"",null,null,null,"","","","",""]
[{"$f":"IFERROR(B148&\" \"&COUNTIFS($B$4:B148,B148),\"\")","v":" 0"},null,null,null,null,"",null,null,null,"","","","",""]
[{"$f":"IFERROR(B149&\" \"&COUNTIFS($B$4:B149,B149),\"\")","v":" 0"},null,null,null,null,"",null,null,null,"","","","",""]
[{"$f":"IFERROR(B150&\" \"&COUNTIFS($B$4:B150,B150),\"\")","v":" 0"},null,null,null,null,"",null,null,null,"","","","",""]
[{"$f":"IFERROR(B151&\" \"&COUNTIFS($B$4:B151,B151),\"\")","v":" 0"},null,null,null,null,"",null,null,null,"","","","",""]
[{"$f":"IFERROR(B152&\" \"&COUNTIFS($B$4:B152,B152),\"\")","v":" 0"},null,null,null,null,"",null,null,null,"","","","",""]
[{"$f":"IFERROR(B153&\" \"&COUNTIFS($B$4:B153,B153),\"\")","v":" 0"},null,null,null,null,"",null,null,null,"","","","",""]
[{"$f":"IFERROR(B154&\" \"&COUNTIFS($B$4:B154,B154),\"\")","v":" 0"},null,null,null,null,"",null,null,null,"","","","",""]
[{"$f":"IFERROR(B155&\" \"&COUNTIFS($B$4:B155,B155),\"\")","v":" 0"},null,null,null,null,"",null,null,null,"","","","",""]
[{"$f":"IFERROR(B156&\" \"&COUNTIFS($B$4:B156,B156),\"\")","v":" 0"},null,null,null,null,"",null,null,null,"","","","",""]
[{"$f":"IFERROR(B157&\" \"&COUNTIFS($B$4:B157,B157),\"\")","v":" 0"},null,null,null,null,"",null,null,null,"","","","",""]
[{"$f":"IFERROR(B158&\" \"&COUNTIFS($B$4:B158,B158),\"\")","v":" 0"},null,null,null,null,"",null,null,null,"","","","",""]
[{"$f":"IFERROR(B159&\" \"&COUNTIFS($B$4:B159,B159),\"\")","v":" 0"},null,null,null,null,"",null,null,null,"","","","",""]
[{"$f":"IFERROR(B160&\" \"&COUNTIFS($B$4:B160,B160),\"\")","v":" 0"},null,null,null,null,"",null,null,null,"","","","",""]
[{"$f":"IFERROR(B161&\" \"&COUNTIFS($B$4:B161,B161),\"\")","v":" 0"},null,null,null,null,"",null,null,null,"","","","",""]
[{"$f":"IFERROR(B162&\" \"&COUNTIFS($B$4:B162,B162),\"\")","v":" 0"},null,null,null,null,"",null,null,null,"","","","",""]
[{"$f":"IFERROR(B163&\" \"&COUNTIFS($B$4:B163,B163),\"\")","v":" 0"},null,null,null,null,"",null,null,null,"","","","",""]
[{"$f":"IFERROR(B164&\" \"&COUNTIFS($B$4:B164,B164),\"\")","v":" 0"},null,null,null,null,"",null,null,null,"","","","",""]
[{"$f":"IFERROR(B165&\" \"&COUNTIFS($B$4:B165,B165),\"\")","v":" 0"},null,null,null,null,"",null,null,null,"","","","",""]
[{"$f":"IFERROR(B166&\" \"&COUNTIFS($B$4:B166,B166),\"\")","v":" 0"},null,null,null,null,"",null,null,null,"","","","",""]
[{"$f":"IFERROR(B167&\" \"&COUNTIFS($B$4:B167,B167),\"\")","v":" 0"},null,null,null,null,"",null,null,null,"","","","",""]
[{"$f":"IFERROR(B168&\" \"&COUNTIFS($B$4:B168,B168),\"\")","v":" 0"},null,null,null,null,"",null,null,null,"","","","",""]
[{"$f":"IFERROR(B169&\" \"&COUNTIFS($B$4:B169,B169),\"\")","v":" 0"},null,null,null,null,"",null,null,null,"","","","",""]
[{"$f":"IFERROR(B170&\" \"&COUNTIFS($B$4:B170,B170),\"\")","v":" 0"},null,null,null,null,"",null,null,null,"","","","",""]
[{"$f":"IFERROR(B171&\" \"&COUNTIFS($B$4:B171,B171),\"\")","v":" 0"},null,null,null,null,"",null,null,null,"","","","",""]
[{"$f":"IFERROR(B172&\" \"&COUNTIFS($B$4:B172,B172),\"\")","v":" 0"},null,null,null,null,"",null,null,null,"","","","",""]
[{"$f":"IFERROR(B173&\" \"&COUNTIFS($B$4:B173,B173),\"\")","v":" 0"},null,null,null,null,"",null,null,null,"","","","",""]
[{"$f":"IFERROR(B174&\" \"&COUNTIFS($B$4:B174,B174),\"\")","v":" 0"},null,null,null,null,"",null,null,null,"","","","",""]
[{"$f":"IFERROR(B175&\" \"&COUNTIFS($B$4:B175,B175),\"\")","v":" 0"},null,null,null,null,"",null,null,null,"","","","",""]
[{"$f":"IFERROR(B176&\" \"&COUNTIFS($B$4:B176,B176),\"\")","v":" 0"},null,null,null,null,"",null,null,null,"","","","",""]
[{"$f":"IFERROR(B177&\" \"&COUNTIFS($B$4:B177,B177),\"\")","v":" 0"},null,null,null,null,"",null,null,null,"","","","",""]
[{"$f":"IFERROR(B178&\" \"&COUNTIFS($B$4:B178,B178),\"\")","v":" 0"},null,null,null,null,"",null,null,null,"","","","",""]
[{"$f":"IFERROR(B179&\" \"&COUNTIFS($B$4:B179,B179),\"\")","v":" 0"},null,null,null,null,"",null,null,null,"","","","",""]
[{"$f":"IFERROR(B180&\" \"&COUNTIFS($B$4:B180,B180),\"\")","v":" 0"},null,null,null,null,"",null,null,null,"","","","",""]
[{"$f":"IFERROR(B181&\" \"&COUNTIFS($B$4:B181,B181),\"\")","v":" 0"},null,null,null,null,"",null,null,null,"","","","",""]
[{"$f":"IFERROR(B182&\" \"&COUNTIFS($B$4:B182,B182),\"\")","v":" 0"},null,null,null,null,"",null,null,null,"","","","",""]
[{"$f":"IFERROR(B183&\" \"&COUNTIFS($B$4:B183,B183),\"\")","v":" 0"},null,null,null,null,"",null,null,null,"","","","",""]
[{"$f":"IFERROR(B184&\" \"&COUNTIFS($B$4:B184,B184),\"\")","v":" 0"},null,null,null,null,"",null,null,null,"","","","",""]
[{"$f":"IFERROR(B185&\" \"&COUNTIFS($B$4:B185,B185),\"\")","v":" 0"},null,null,null,null,"",null,null,null,"","","","",""]
[{"$f":"IFERROR(B186&\" \"&COUNTIFS($B$4:B186,B186),\"\")","v":" 0"},null,null,null,null,"",null,null,null,"","","","",""]
[{"$f":"IFERROR(B187&\" \"&COUNTIFS($B$4:B187,B187),\"\")","v":" 0"},null,null,null,null,"",null,null,null,{"$f":"IFERROR(VLOOKUP(B187,data_kas3,12,FALSE),\"\")","v":""},{"$f":"IFERROR(VLOOKUP(B187,data_kas3,3,FALSE),\"\")","v":""},"",{"$f":"IFERROR(VLOOKUP(B187,data_kas3,5,FALSE),\"\")","v":""},""]
[{"$f":"IFERROR(B188&\" \"&COUNTIFS($B$4:B188,B188),\"\")","v":" 0"},null,null,null,null,"",null,null,null,"","","","",{"$f":"IF(K188=\"\",\"\",K188*M188)","v":""}]
[{"$f":"IFERROR(B189&\" \"&COUNTIFS($B$4:B189,B189),\"\")","v":" 0"},null,null,null,null,"",null,null,null,"","","","",""]
[{"$f":"IFERROR(B190&\" \"&COUNTIFS($B$4:B190,B190),\"\")","v":" 0"},null,null,null,null,"",null,null,null,"","","","",""]
[{"$f":"IFERROR(B191&\" \"&COUNTIFS($B$4:B191,B191),\"\")","v":" 0"},null,null,null,null,"",null,null,null,"","","","",""]
[{"$f":"IFERROR(B192&\" \"&COUNTIFS($B$4:B192,B192),\"\")","v":" 0"},null,null,null,null,"",null,null,null,"","","","",""]
[{"$f":"IFERROR(B193&\" \"&COUNTIFS($B$4:B193,B193),\"\")","v":" 0"},null,null,null,null,"",null,null,null,"","","","",""]
[{"$f":"IFERROR(B194&\" \"&COUNTIFS($B$4:B194,B194),\"\")","v":" 0"},null,null,null,null,"",null,null,null,"","","","",""]
[{"$f":"IFERROR(B195&\" \"&COUNTIFS($B$4:B195,B195),\"\")","v":" 0"},null,null,null,null,"",null,null,null,"","","","",""]
[{"$f":"IFERROR(B196&\" \"&COUNTIFS($B$4:B196,B196),\"\")","v":" 0"},null,null,null,null,{"$f":"IFERROR(VLOOKUP(E196,data_guru,3,FALSE),\"\")","v":""},null,null,null,"","",{"$f":"IFERROR(VLOOKUP(B196,data_kas3,4,FALSE),\"\")","v":""},"",""]
[{"$f":"IFERROR(B197&\" \"&COUNTIFS($B$4:B197,B197),\"\")","v":" 0"},null,null,null,null,"",null,null,null,"","","","",""]
[{"$f":"IFERROR(B198&\" \"&COUNTIFS($B$4:B198,B198),\"\")","v":" 0"},null,null,null,null,"",null,null,null,"","","","",""]
[{"$f":"IFERROR(B199&\" \"&COUNTIFS($B$4:B199,B199),\"\")","v":" 0"},null,null,null,null,"",null,null,null,"","","","",""]
[{"$f":"IFERROR(B200&\" \"&COUNTIFS($B$4:B200,B200),\"\")","v":" 0"},null,null,null,null,"",null,null,null,"","","","",""]
[{"$f":"IFERROR(B201&\" \"&COUNTIFS($B$4:B201,B201),\"\")","v":" 0"},null,null,null,null,"",null,null,null,"","","","",""]
[{"$f":"IFERROR(B202&\" \"&COUNTIFS($B$4:B202,B202),\"\")","v":" 0"},null,null,null,null,"",null,null,null,"","","","",""]
[{"$f":"IFERROR(B203&\" \"&COUNTIFS($B$4:B203,B203),\"\")","v":" 0"},null,null,null,null,"",null,null,null,"","","","",""]
[{"$f":"IFERROR(B204&\" \"&COUNTIFS($B$4:B204,B204),\"\")","v":" 0"},null,null,null,null,"",null,null,null,"","","","",""]
[{"$f":"IFERROR(B205&\" \"&COUNTIFS($B$4:B205,B205),\"\")","v":" 0"},null,null,null,null,"",null,null,null,"","","","",""]
[{"$f":"IFERROR(B206&\" \"&COUNTIFS($B$4:B206,B206),\"\")","v":" 0"},null,null,null,null,"",null,null,null,"","","","",""]
[{"$f":"IFERROR(B207&\" \"&COUNTIFS($B$4:B207,B207),\"\")","v":" 0"},null,null,null,null,"",null,null,null,"","","","",""]
[{"$f":"IFERROR(B208&\" \"&COUNTIFS($B$4:B208,B208),\"\")","v":" 0"},null,null,null,null,"",null,null,null,"","","","",""]
[{"$f":"IFERROR(B209&\" \"&COUNTIFS($B$4:B209,B209),\"\")","v":" 0"},null,null,null,null,"",null,null,null,"","","","",""]
[{"$f":"IFERROR(B210&\" \"&COUNTIFS($B$4:B210,B210),\"\")","v":" 0"},null,null,null,null,"",null,null,null,"","","","",""]
[{"$f":"IFERROR(B211&\" \"&COUNTIFS($B$4:B211,B211),\"\")","v":" 0"},null,null,null,null,"",null,null,null,"","","","",""]
[{"$f":"IFERROR(B212&\" \"&COUNTIFS($B$4:B212,B212),\"\")","v":" 0"},null,null,null,null,"",null,null,null,"","","","",""]
[{"$f":"IFERROR(B213&\" \"&COUNTIFS($B$4:B213,B213),\"\")","v":" 0"},null,null,null,null,"",null,null,null,"","","","",""]
[{"$f":"IFERROR(B214&\" \"&COUNTIFS($B$4:B214,B214),\"\")","v":" 0"},null,null,null,null,"",null,null,null,"","","","",""]
[{"$f":"IFERROR(B215&\" \"&COUNTIFS($B$4:B215,B215),\"\")","v":" 0"},null,null,null,null,"",null,null,null,"","","","",""]
[{"$f":"IFERROR(B216&\" \"&COUNTIFS($B$4:B216,B216),\"\")","v":" 0"},null,null,null,null,"",null,null,null,"","","","",""]
[{"$f":"IFERROR(B217&\" \"&COUNTIFS($B$4:B217,B217),\"\")","v":" 0"},null,null,null,null,"",null,null,null,"","","","",""]
[{"$f":"IFERROR(B218&\" \"&COUNTIFS($B$4:B218,B218),\"\")","v":" 0"},null,null,null,null,"",null,null,null,"","","","",""]
[{"$f":"IFERROR(B219&\" \"&COUNTIFS($B$4:B219,B219),\"\")","v":" 0"},null,null,null,null,"",null,null,null,"","","","",""]
[{"$f":"IFERROR(B220&\" \"&COUNTIFS($B$4:B220,B220),\"\")","v":" 0"},null,null,null,null,"",null,null,null,"","","","",""]
[{"$f":"IFERROR(B221&\" \"&COUNTIFS($B$4:B221,B221),\"\")","v":" 0"},null,null,null,null,"",null,null,null,"","","","",""]
[{"$f":"IFERROR(B222&\" \"&COUNTIFS($B$4:B222,B222),\"\")","v":" 0"},null,null,null,null,"",null,null,null,"","","","",""]
[{"$f":"IFERROR(B223&\" \"&COUNTIFS($B$4:B223,B223),\"\")","v":" 0"},null,null,null,null,"",null,null,null,"","","","",""]
[{"$f":"IFERROR(B224&\" \"&COUNTIFS($B$4:B224,B224),\"\")","v":" 0"},null,null,null,null,"",null,null,null,"","","","",""]
[{"$f":"IFERROR(B225&\" \"&COUNTIFS($B$4:B225,B225),\"\")","v":" 0"},null,null,null,null,"",null,null,null,"","","","",""]
[{"$f":"IFERROR(B226&\" \"&COUNTIFS($B$4:B226,B226),\"\")","v":" 0"},null,null,null,null,"",null,null,null,"","","","",""]
[{"$f":"IFERROR(B227&\" \"&COUNTIFS($B$4:B227,B227),\"\")","v":" 0"},null,null,null,null,"",null,null,null,"","","","",""]
[{"$f":"IFERROR(B228&\" \"&COUNTIFS($B$4:B228,B228),\"\")","v":" 0"},null,null,null,null,"",null,null,null,"","","","",""]
[{"$f":"IFERROR(B229&\" \"&COUNTIFS($B$4:B229,B229),\"\")","v":" 0"},null,null,null,null,"",null,null,null,"","","","",""]
[{"$f":"IFERROR(B230&\" \"&COUNTIFS($B$4:B230,B230),\"\")","v":" 0"},null,null,null,null,"",null,null,null,"","","","",""]
[{"$f":"IFERROR(B231&\" \"&COUNTIFS($B$4:B231,B231),\"\")","v":" 0"},null,null,null,null,"",null,null,null,"","","","",""]
[{"$f":"IFERROR(B232&\" \"&COUNTIFS($B$4:B232,B232),\"\")","v":" 0"},null,null,null,null,"",null,null,null,"","","","",""]
[{"$f":"IFERROR(B233&\" \"&COUNTIFS($B$4:B233,B233),\"\")","v":" 0"},null,null,null,null,"",null,null,null,"","","","",""]
[{"$f":"IFERROR(B234&\" \"&COUNTIFS($B$4:B234,B234),\"\")","v":" 0"},null,null,null,null,"",null,null,null,"","","","",""]
[{"$f":"IFERROR(B235&\" \"&COUNTIFS($B$4:B235,B235),\"\")","v":" 0"},null,null,null,null,"",null,null,null,"","","","",""]
[{"$f":"IFERROR(B236&\" \"&COUNTIFS($B$4:B236,B236),\"\")","v":" 0"},null,null,null,null,"",null,null,null,"","","","",""]
[{"$f":"IFERROR(B237&\" \"&COUNTIFS($B$4:B237,B237),\"\")","v":" 0"},null,null,null,null,"",null,null,null,"","","","",""]
[{"$f":"IFERROR(B238&\" \"&COUNTIFS($B$4:B238,B238),\"\")","v":" 0"},null,null,null,null,"",null,null,null,"","","","",""]
[{"$f":"IFERROR(B239&\" \"&COUNTIFS($B$4:B239,B239),\"\")","v":" 0"},null,null,null,null,"",null,null,null,"","","","",""]
[{"$f":"IFERROR(B240&\" \"&COUNTIFS($B$4:B240,B240),\"\")","v":" 0"},null,null,null,null,"",null,null,null,"","","","",""]
[{"$f":"IFERROR(B241&\" \"&COUNTIFS($B$4:B241,B241),\"\")","v":" 0"},null,null,null,null,"",null,null,null,"","","","",""]
[{"$f":"IFERROR(B242&\" \"&COUNTIFS($B$4:B242,B242),\"\")","v":" 0"},null,null,null,null,"",null,null,null,"","","","",""]
[{"$f":"IFERROR(B243&\" \"&COUNTIFS($B$4:B243,B243),\"\")","v":" 0"},null,null,null,null,"",null,null,null,"","","","",""]
[{"$f":"IFERROR(B244&\" \"&COUNTIFS($B$4:B244,B244),\"\")","v":" 0"},null,null,null,null,"",null,null,null,"","","","",""]
[{"$f":"IFERROR(B245&\" \"&COUNTIFS($B$4:B245,B245),\"\")","v":" 0"},null,null,null,null,"",null,null,null,"","","","",""]
[{"$f":"IFERROR(B246&\" \"&COUNTIFS($B$4:B246,B246),\"\")","v":" 0"},null,null,null,null,"",null,null,null,"","","","",""]
[{"$f":"IFERROR(B247&\" \"&COUNTIFS($B$4:B247,B247),\"\")","v":" 0"},null,null,null,null,"",null,null,null,"","","","",""]
[{"$f":"IFERROR(B248&\" \"&COUNTIFS($B$4:B248,B248),\"\")","v":" 0"},null,null,null,null,"",null,null,null,"","","","",""]
[{"$f":"IFERROR(B249&\" \"&COUNTIFS($B$4:B249,B249),\"\")","v":" 0"},null,null,null,null,"",null,null,null,"","","","",""]
[{"$f":"IFERROR(B250&\" \"&COUNTIFS($B$4:B250,B250),\"\")","v":" 0"},null,null,null,null,"",null,null,null,"","","","",""]
[{"$f":"IFERROR(B251&\" \"&COUNTIFS($B$4:B251,B251),\"\")","v":" 0"},null,null,null,null,"",null,null,null,{"$f":"IFERROR(VLOOKUP(B251,data_kas3,12,FALSE),\"\")","v":""},{"$f":"IFERROR(VLOOKUP(B251,data_kas3,3,FALSE),\"\")","v":""},"",{"$f":"IFERROR(VLOOKUP(B251,data_kas3,5,FALSE),\"\")","v":""},""]
[{"$f":"IFERROR(B252&\" \"&COUNTIFS($B$4:B252,B252),\"\")","v":" 0"},null,null,null,null,"",null,null,null,"","","","",{"$f":"IF(K252=\"\",\"\",K252*M252)","v":""}]
[{"$f":"IFERROR(B253&\" \"&COUNTIFS($B$4:B253,B253),\"\")","v":" 0"},null,null,null,null,"",null,null,null,"","","","",""]
[{"$f":"IFERROR(B254&\" \"&COUNTIFS($B$4:B254,B254),\"\")","v":" 0"},null,null,null,null,"",null,null,null,"","","","",""]
[{"$f":"IFERROR(B255&\" \"&COUNTIFS($B$4:B255,B255),\"\")","v":" 0"},null,null,null,null,"",null,null,null,"","","","",""]
[{"$f":"IFERROR(B256&\" \"&COUNTIFS($B$4:B256,B256),\"\")","v":" 0"},null,null,null,null,"",null,null,null,"","","","",""]
[{"$f":"IFERROR(B257&\" \"&COUNTIFS($B$4:B257,B257),\"\")","v":" 0"},null,null,null,null,"",null,null,null,"","","","",""]
[{"$f":"IFERROR(B258&\" \"&COUNTIFS($B$4:B258,B258),\"\")","v":" 0"},null,null,null,null,"",null,null,null,"","","","",""]
[{"$f":"IFERROR(B259&\" \"&COUNTIFS($B$4:B259,B259),\"\")","v":" 0"},null,null,null,null,"",null,null,null,"","","","",""]
[{"$f":"IFERROR(B260&\" \"&COUNTIFS($B$4:B260,B260),\"\")","v":" 0"},null,null,null,null,{"$f":"IFERROR(VLOOKUP(E260,data_guru,3,FALSE),\"\")","v":""},null,null,null,"","",{"$f":"IFERROR(VLOOKUP(B260,data_kas3,4,FALSE),\"\")","v":""},"",""]
[{"$f":"IFERROR(B261&\" \"&COUNTIFS($B$4:B261,B261),\"\")","v":" 0"},null,null,null,null,"",null,null,null,"","","","",""]
[{"$f":"IFERROR(B262&\" \"&COUNTIFS($B$4:B262,B262),\"\")","v":" 0"},null,null,null,null,"",null,null,null,"","","","",""]
[{"$f":"IFERROR(B263&\" \"&COUNTIFS($B$4:B263,B263),\"\")","v":" 0"},null,null,null,null,"",null,null,null,"","","","",""]
[{"$f":"IFERROR(B264&\" \"&COUNTIFS($B$4:B264,B264),\"\")","v":" 0"},null,null,null,null,"",null,null,null,"","","","",""]
[{"$f":"IFERROR(B265&\" \"&COUNTIFS($B$4:B265,B265),\"\")","v":" 0"},null,null,null,null,"",null,null,null,"","","","",""]
[{"$f":"IFERROR(B266&\" \"&COUNTIFS($B$4:B266,B266),\"\")","v":" 0"},null,null,null,null,"",null,null,null,"","","","",""]
[{"$f":"IFERROR(B267&\" \"&COUNTIFS($B$4:B267,B267),\"\")","v":" 0"},null,null,null,null,"",null,null,null,"","","","",""]
[{"$f":"IFERROR(B268&\" \"&COUNTIFS($B$4:B268,B268),\"\")","v":" 0"},null,null,null,null,"",null,null,null,"","","","",""]
[{"$f":"IFERROR(B269&\" \"&COUNTIFS($B$4:B269,B269),\"\")","v":" 0"},null,null,null,null,"",null,null,null,"","","","",""]
[{"$f":"IFERROR(B270&\" \"&COUNTIFS($B$4:B270,B270),\"\")","v":" 0"},null,null,null,null,"",null,null,null,"","","","",""]
[{"$f":"IFERROR(B271&\" \"&COUNTIFS($B$4:B271,B271),\"\")","v":" 0"},null,null,null,null,"",null,null,null,"","","","",""]
[{"$f":"IFERROR(B272&\" \"&COUNTIFS($B$4:B272,B272),\"\")","v":" 0"},null,null,null,null,"",null,null,null,"","","","",""]
[{"$f":"IFERROR(B273&\" \"&COUNTIFS($B$4:B273,B273),\"\")","v":" 0"},null,null,null,null,"",null,null,null,"","","","",""]
[{"$f":"IFERROR(B274&\" \"&COUNTIFS($B$4:B274,B274),\"\")","v":" 0"},null,null,null,null,"",null,null,null,"","","","",""]
[{"$f":"IFERROR(B275&\" \"&COUNTIFS($B$4:B275,B275),\"\")","v":" 0"},null,null,null,null,"",null,null,null,"","","","",""]
[{"$f":"IFERROR(B276&\" \"&COUNTIFS($B$4:B276,B276),\"\")","v":" 0"},null,null,null,null,"",null,null,null,"","","","",""]
[{"$f":"IFERROR(B277&\" \"&COUNTIFS($B$4:B277,B277),\"\")","v":" 0"},null,null,null,null,"",null,null,null,"","","","",""]
[{"$f":"IFERROR(B278&\" \"&COUNTIFS($B$4:B278,B278),\"\")","v":" 0"},null,null,null,null,"",null,null,null,"","","","",""]
[{"$f":"IFERROR(B279&\" \"&COUNTIFS($B$4:B279,B279),\"\")","v":" 0"},null,null,null,null,"",null,null,null,"","","","",""]
[{"$f":"IFERROR(B280&\" \"&COUNTIFS($B$4:B280,B280),\"\")","v":" 0"},null,null,null,null,"",null,null,null,"","","","",""]
[{"$f":"IFERROR(B281&\" \"&COUNTIFS($B$4:B281,B281),\"\")","v":" 0"},null,null,null,null,"",null,null,null,"","","","",""]
[{"$f":"IFERROR(B282&\" \"&COUNTIFS($B$4:B282,B282),\"\")","v":" 0"},null,null,null,null,"",null,null,null,"","","","",""]
[{"$f":"IFERROR(B283&\" \"&COUNTIFS($B$4:B283,B283),\"\")","v":" 0"},null,null,null,null,"",null,null,null,"","","","",""]
[{"$f":"IFERROR(B284&\" \"&COUNTIFS($B$4:B284,B284),\"\")","v":" 0"},null,null,null,null,"",null,null,null,"","","","",""]
[{"$f":"IFERROR(B285&\" \"&COUNTIFS($B$4:B285,B285),\"\")","v":" 0"},null,null,null,null,"",null,null,null,"","","","",""]
[{"$f":"IFERROR(B286&\" \"&COUNTIFS($B$4:B286,B286),\"\")","v":" 0"},null,null,null,null,"",null,null,null,"","","","",""]
[{"$f":"IFERROR(B287&\" \"&COUNTIFS($B$4:B287,B287),\"\")","v":" 0"},null,null,null,null,"",null,null,null,"","","","",""]
[{"$f":"IFERROR(B288&\" \"&COUNTIFS($B$4:B288,B288),\"\")","v":" 0"},null,null,null,null,"",null,null,null,"","","","",""]
[{"$f":"IFERROR(B289&\" \"&COUNTIFS($B$4:B289,B289),\"\")","v":" 0"},null,null,null,null,"",null,null,null,"","","","",""]
[{"$f":"IFERROR(B290&\" \"&COUNTIFS($B$4:B290,B290),\"\")","v":" 0"},null,null,null,null,"",null,null,null,"","","","",""]
[{"$f":"IFERROR(B291&\" \"&COUNTIFS($B$4:B291,B291),\"\")","v":" 0"},null,null,null,null,"",null,null,null,"","","","",""]
[{"$f":"IFERROR(B292&\" \"&COUNTIFS($B$4:B292,B292),\"\")","v":" 0"},null,null,null,null,"",null,null,null,"","","","",""]
[{"$f":"IFERROR(B293&\" \"&COUNTIFS($B$4:B293,B293),\"\")","v":" 0"},null,null,null,null,"",null,null,null,"","","","",""]
[{"$f":"IFERROR(B294&\" \"&COUNTIFS($B$4:B294,B294),\"\")","v":" 0"},null,null,null,null,"",null,null,null,"","","","",""]
[{"$f":"IFERROR(B295&\" \"&COUNTIFS($B$4:B295,B295),\"\")","v":" 0"},null,null,null,null,"",null,null,null,"","","","",""]
[{"$f":"IFERROR(B296&\" \"&COUNTIFS($B$4:B296,B296),\"\")","v":" 0"},null,null,null,null,"",null,null,null,"","","","",""]
[{"$f":"IFERROR(B297&\" \"&COUNTIFS($B$4:B297,B297),\"\")","v":" 0"},null,null,null,null,"",null,null,null,"","","","",""]
[{"$f":"IFERROR(B298&\" \"&COUNTIFS($B$4:B298,B298),\"\")","v":" 0"},null,null,null,null,"",null,null,null,"","","","",""]
[{"$f":"IFERROR(B299&\" \"&COUNTIFS($B$4:B299,B299),\"\")","v":" 0"},null,null,null,null,"",null,null,null,"","","","",""]
[{"$f":"IFERROR(B300&\" \"&COUNTIFS($B$4:B300,B300),\"\")","v":" 0"},null,null,null,null,"",null,null,null,"","","","",""]
[{"$f":"IFERROR(B301&\" \"&COUNTIFS($B$4:B301,B301),\"\")","v":" 0"},null,null,null,null,"",null,null,null,"","","","",""]
[{"$f":"IFERROR(B302&\" \"&COUNTIFS($B$4:B302,B302),\"\")","v":" 0"},null,null,null,null,"",null,null,null,"","","","",""]
[{"$f":"IFERROR(B303&\" \"&COUNTIFS($B$4:B303,B303),\"\")","v":" 0"},null,null,null,null,"",null,null,null,"","","","",""]
[{"$f":"IFERROR(B304&\" \"&COUNTIFS($B$4:B304,B304),\"\")","v":" 0"},null,null,null,null,"",null,null,null,"","","","",""]
[{"$f":"IFERROR(B305&\" \"&COUNTIFS($B$4:B305,B305),\"\")","v":" 0"},null,null,null,null,"",null,null,null,"","","","",""]
[{"$f":"IFERROR(B306&\" \"&COUNTIFS($B$4:B306,B306),\"\")","v":" 0"},null,null,null,null,"",null,null,null,"","","","",""]
[{"$f":"IFERROR(B307&\" \"&COUNTIFS($B$4:B307,B307),\"\")","v":" 0"},null,null,null,null,"",null,null,null,"","","","",""]
[{"$f":"IFERROR(B308&\" \"&COUNTIFS($B$4:B308,B308),\"\")","v":" 0"},null,null,null,null,"",null,null,null,"","","","",""]
[{"$f":"IFERROR(B309&\" \"&COUNTIFS($B$4:B309,B309),\"\")","v":" 0"},null,null,null,null,"",null,null,null,"","","","",""]
[{"$f":"IFERROR(B310&\" \"&COUNTIFS($B$4:B310,B310),\"\")","v":" 0"},null,null,null,null,"",null,null,null,"","","","",""]
[{"$f":"IFERROR(B311&\" \"&COUNTIFS($B$4:B311,B311),\"\")","v":" 0"},null,null,null,null,"",null,null,null,"","","","",""]
[{"$f":"IFERROR(B312&\" \"&COUNTIFS($B$4:B312,B312),\"\")","v":" 0"},null,null,null,null,"",null,null,null,"","","","",""]
[{"$f":"IFERROR(B313&\" \"&COUNTIFS($B$4:B313,B313),\"\")","v":" 0"},null,null,null,null,"",null,null,null,"","","","",""]
[{"$f":"IFERROR(B314&\" \"&COUNTIFS($B$4:B314,B314),\"\")","v":" 0"},null,null,null,null,"",null,null,null,"","","","",""]
[{"$f":"IFERROR(B315&\" \"&COUNTIFS($B$4:B315,B315),\"\")","v":" 0"},null,null,null,null,"",null,null,null,{"$f":"IFERROR(VLOOKUP(B315,data_kas3,12,FALSE),\"\")","v":""},{"$f":"IFERROR(VLOOKUP(B315,data_kas3,3,FALSE),\"\")","v":""},"",{"$f":"IFERROR(VLOOKUP(B315,data_kas3,5,FALSE),\"\")","v":""},""]
[{"$f":"IFERROR(B316&\" \"&COUNTIFS($B$4:B316,B316),\"\")","v":" 0"},null,null,null,null,"",null,null,null,"","","","",{"$f":"IF(K316=\"\",\"\",K316*M316)","v":""}]
[{"$f":"IFERROR(B317&\" \"&COUNTIFS($B$4:B317,B317),\"\")","v":" 0"},null,null,null,null,"",null,null,null,"","","","",""]
[{"$f":"IFERROR(B318&\" \"&COUNTIFS($B$4:B318,B318),\"\")","v":" 0"},null,null,null,null,"",null,null,null,"","","","",""]
[{"$f":"IFERROR(B319&\" \"&COUNTIFS($B$4:B319,B319),\"\")","v":" 0"},null,null,null,null,"",null,null,null,"","","","",""]
[{"$f":"IFERROR(B320&\" \"&COUNTIFS($B$4:B320,B320),\"\")","v":" 0"},null,null,null,null,"",null,null,null,"","","","",""]
[{"$f":"IFERROR(B321&\" \"&COUNTIFS($B$4:B321,B321),\"\")","v":" 0"},null,null,null,null,"",null,null,null,"","","","",""]
[{"$f":"IFERROR(B322&\" \"&COUNTIFS($B$4:B322,B322),\"\")","v":" 0"},null,null,null,null,"",null,null,null,"","","","",""]
[{"$f":"IFERROR(B323&\" \"&COUNTIFS($B$4:B323,B323),\"\")","v":" 0"},null,null,null,null,"",null,null,null,"","","","",""]
[{"$f":"IFERROR(B324&\" \"&COUNTIFS($B$4:B324,B324),\"\")","v":" 0"},null,null,null,null,{"$f":"IFERROR(VLOOKUP(E324,data_guru,3,FALSE),\"\")","v":""},null,null,null,"","",{"$f":"IFERROR(VLOOKUP(B324,data_kas3,4,FALSE),\"\")","v":""},"",""]
[{"$f":"IFERROR(B325&\" \"&COUNTIFS($B$4:B325,B325),\"\")","v":" 0"},null,null,null,null,"",null,null,null,"","","","",""]
[{"$f":"IFERROR(B326&\" \"&COUNTIFS($B$4:B326,B326),\"\")","v":" 0"},null,null,null,null,"",null,null,null,"","","","",""]
[{"$f":"IFERROR(B327&\" \"&COUNTIFS($B$4:B327,B327),\"\")","v":" 0"},null,null,null,null,"",null,null,null,"","","","",""]
[{"$f":"IFERROR(B328&\" \"&COUNTIFS($B$4:B328,B328),\"\")","v":" 0"},null,null,null,null,"",null,null,null,"","","","",""]
[{"$f":"IFERROR(B329&\" \"&COUNTIFS($B$4:B329,B329),\"\")","v":" 0"},null,null,null,null,"",null,null,null,"","","","",""]
[{"$f":"IFERROR(B330&\" \"&COUNTIFS($B$4:B330,B330),\"\")","v":" 0"},null,null,null,null,"",null,null,null,"","","","",""]
[{"$f":"IFERROR(B331&\" \"&COUNTIFS($B$4:B331,B331),\"\")","v":" 0"},null,null,null,null,"",null,null,null,"","","","",""]
[{"$f":"IFERROR(B332&\" \"&COUNTIFS($B$4:B332,B332),\"\")","v":" 0"},null,null,null,null,"",null,null,null,"","","","",""]
[{"$f":"IFERROR(B333&\" \"&COUNTIFS($B$4:B333,B333),\"\")","v":" 0"},null,null,null,null,"",null,null,null,"","","","",""]
[{"$f":"IFERROR(B334&\" \"&COUNTIFS($B$4:B334,B334),\"\")","v":" 0"},null,null,null,null,"",null,null,null,"","","","",""]
[{"$f":"IFERROR(B335&\" \"&COUNTIFS($B$4:B335,B335),\"\")","v":" 0"},null,null,null,null,"",null,null,null,"","","","",""]
[{"$f":"IFERROR(B336&\" \"&COUNTIFS($B$4:B336,B336),\"\")","v":" 0"},null,null,null,null,"",null,null,null,"","","","",""]
[{"$f":"IFERROR(B337&\" \"&COUNTIFS($B$4:B337,B337),\"\")","v":" 0"},null,null,null,null,"",null,null,null,"","","","",""]
[{"$f":"IFERROR(B338&\" \"&COUNTIFS($B$4:B338,B338),\"\")","v":" 0"},null,null,null,null,"",null,null,null,"","","","",""]
[{"$f":"IFERROR(B339&\" \"&COUNTIFS($B$4:B339,B339),\"\")","v":" 0"},null,null,null,null,"",null,null,null,"","","","",""]
[{"$f":"IFERROR(B340&\" \"&COUNTIFS($B$4:B340,B340),\"\")","v":" 0"},null,null,null,null,"",null,null,null,"","","","",""]
[{"$f":"IFERROR(B341&\" \"&COUNTIFS($B$4:B341,B341),\"\")","v":" 0"},null,null,null,null,"",null,null,null,"","","","",""]
[{"$f":"IFERROR(B342&\" \"&COUNTIFS($B$4:B342,B342),\"\")","v":" 0"},null,null,null,null,"",null,null,null,"","","","",""]
[{"$f":"IFERROR(B343&\" \"&COUNTIFS($B$4:B343,B343),\"\")","v":" 0"},null,null,null,null,"",null,null,null,"","","","",""]
[{"$f":"IFERROR(B344&\" \"&COUNTIFS($B$4:B344,B344),\"\")","v":" 0"},null,null,null,null,"",null,null,null,"","","","",""]
[{"$f":"IFERROR(B345&\" \"&COUNTIFS($B$4:B345,B345),\"\")","v":" 0"},null,null,null,null,"",null,null,null,"","","","",""]
[{"$f":"IFERROR(B346&\" \"&COUNTIFS($B$4:B346,B346),\"\")","v":" 0"},null,null,null,null,"",null,null,null,"","","","",""]
[{"$f":"IFERROR(B347&\" \"&COUNTIFS($B$4:B347,B347),\"\")","v":" 0"},null,null,null,null,"",null,null,null,"","","","",""]
[{"$f":"IFERROR(B348&\" \"&COUNTIFS($B$4:B348,B348),\"\")","v":" 0"},null,null,null,null,"",null,null,null,"","","","",""]
[{"$f":"IFERROR(B349&\" \"&COUNTIFS($B$4:B349,B349),\"\")","v":" 0"},null,null,null,null,"",null,null,null,"","","","",""]
[{"$f":"IFERROR(B350&\" \"&COUNTIFS($B$4:B350,B350),\"\")","v":" 0"},null,null,null,null,"",null,null,null,"","","","",""]
[{"$f":"IFERROR(B351&\" \"&COUNTIFS($B$4:B351,B351),\"\")","v":" 0"},null,null,null,null,"",null,null,null,"","","","",""]
[{"$f":"IFERROR(B352&\" \"&COUNTIFS($B$4:B352,B352),\"\")","v":" 0"},null,null,null,null,"",null,null,null,"","","","",""]
[{"$f":"IFERROR(B353&\" \"&COUNTIFS($B$4:B353,B353),\"\")","v":" 0"},null,null,null,null,"",null,null,null,"","","","",""]
[{"$f":"IFERROR(B354&\" \"&COUNTIFS($B$4:B354,B354),\"\")","v":" 0"},null,null,null,null,"",null,null,null,"","","","",""]
[{"$f":"IFERROR(B355&\" \"&COUNTIFS($B$4:B355,B355),\"\")","v":" 0"},null,null,null,null,"",null,null,null,"","","","",""]
[{"$f":"IFERROR(B356&\" \"&COUNTIFS($B$4:B356,B356),\"\")","v":" 0"},null,null,null,null,"",null,null,null,"","","","",""]
[{"$f":"IFERROR(B357&\" \"&COUNTIFS($B$4:B357,B357),\"\")","v":" 0"},null,null,null,null,"",null,null,null,"","","","",""]
[{"$f":"IFERROR(B358&\" \"&COUNTIFS($B$4:B358,B358),\"\")","v":" 0"},null,null,null,null,"",null,null,null,"","","","",""]
[{"$f":"IFERROR(B359&\" \"&COUNTIFS($B$4:B359,B359),\"\")","v":" 0"},null,null,null,null,"",null,null,null,"","","","",""]
[{"$f":"IFERROR(B360&\" \"&COUNTIFS($B$4:B360,B360),\"\")","v":" 0"},null,null,null,null,"",null,null,null,"","","","",""]
[{"$f":"IFERROR(B361&\" \"&COUNTIFS($B$4:B361,B361),\"\")","v":" 0"},null,null,null,null,"",null,null,null,"","","","",""]
[{"$f":"IFERROR(B362&\" \"&COUNTIFS($B$4:B362,B362),\"\")","v":" 0"},null,null,null,null,"",null,null,null,"","","","",""]
[{"$f":"IFERROR(B363&\" \"&COUNTIFS($B$4:B363,B363),\"\")","v":" 0"},null,null,null,null,"",null,null,null,"","","","",""]
[{"$f":"IFERROR(B364&\" \"&COUNTIFS($B$4:B364,B364),\"\")","v":" 0"},null,null,null,null,"",null,null,null,"","","","",""]
[{"$f":"IFERROR(B365&\" \"&COUNTIFS($B$4:B365,B365),\"\")","v":" 0"},null,null,null,null,"",null,null,null,"","","","",""]
[{"$f":"IFERROR(B366&\" \"&COUNTIFS($B$4:B366,B366),\"\")","v":" 0"},null,null,null,null,"",null,null,null,"","","","",""]
[{"$f":"IFERROR(B367&\" \"&COUNTIFS($B$4:B367,B367),\"\")","v":" 0"},null,null,null,null,"",null,null,null,"","","","",""]
[{"$f":"IFERROR(B368&\" \"&COUNTIFS($B$4:B368,B368),\"\")","v":" 0"},null,null,null,null,"",null,null,null,"","","","",""]
[{"$f":"IFERROR(B369&\" \"&COUNTIFS($B$4:B369,B369),\"\")","v":" 0"},null,null,null,null,"",null,null,null,"","","","",""]
[{"$f":"IFERROR(B370&\" \"&COUNTIFS($B$4:B370,B370),\"\")","v":" 0"},null,null,null,null,"",null,null,null,"","","","",""]
[{"$f":"IFERROR(B371&\" \"&COUNTIFS($B$4:B371,B371),\"\")","v":" 0"},null,null,null,null,"",null,null,null,"","","","",""]
[{"$f":"IFERROR(B372&\" \"&COUNTIFS($B$4:B372,B372),\"\")","v":" 0"},null,null,null,null,"",null,null,null,"","","","",""]
[{"$f":"IFERROR(B373&\" \"&COUNTIFS($B$4:B373,B373),\"\")","v":" 0"},null,null,null,null,"",null,null,null,"","","","",""]
[{"$f":"IFERROR(B374&\" \"&COUNTIFS($B$4:B374,B374),\"\")","v":" 0"},null,null,null,null,"",null,null,null,"","","","",""]
[{"$f":"IFERROR(B375&\" \"&COUNTIFS($B$4:B375,B375),\"\")","v":" 0"},null,null,null,null,"",null,null,null,"","","","",""]
[{"$f":"IFERROR(B376&\" \"&COUNTIFS($B$4:B376,B376),\"\")","v":" 0"},null,null,null,null,"",null,null,null,"","","","",""]
[{"$f":"IFERROR(B377&\" \"&COUNTIFS($B$4:B377,B377),\"\")","v":" 0"},null,null,null,null,"",null,null,null,"","","","",""]
[{"$f":"IFERROR(B378&\" \"&COUNTIFS($B$4:B378,B378),\"\")","v":" 0"},null,null,null,null,"",null,null,null,"","","","",""]
[{"$f":"IFERROR(B379&\" \"&COUNTIFS($B$4:B379,B379),\"\")","v":" 0"},null,null,null,null,"",null,null,null,{"$f":"IFERROR(VLOOKUP(B379,data_kas3,12,FALSE),\"\")","v":""},{"$f":"IFERROR(VLOOKUP(B379,data_kas3,3,FALSE),\"\")","v":""},"",{"$f":"IFERROR(VLOOKUP(B379,data_kas3,5,FALSE),\"\")","v":""},""]
[{"$f":"IFERROR(B380&\" \"&COUNTIFS($B$4:B380,B380),\"\")","v":" 0"},null,null,null,null,"",null,null,null,"","","","",{"$f":"IF(K380=\"\",\"\",K380*M380)","v":""}]
[{"$f":"IFERROR(B381&\" \"&COUNTIFS($B$4:B381,B381),\"\")","v":" 0"},null,null,null,null,"",null,null,null,"","","","",""]
[{"$f":"IFERROR(B382&\" \"&COUNTIFS($B$4:B382,B382),\"\")","v":" 0"},null,null,null,null,"",null,null,null,"","","","",""]
[{"$f":"IFERROR(B383&\" \"&COUNTIFS($B$4:B383,B383),\"\")","v":" 0"},null,null,null,null,"",null,null,null,"","","","",""]
[{"$f":"IFERROR(B384&\" \"&COUNTIFS($B$4:B384,B384),\"\")","v":" 0"},null,null,null,null,"",null,null,null,"","","","",""]
[{"$f":"IFERROR(B385&\" \"&COUNTIFS($B$4:B385,B385),\"\")","v":" 0"},null,null,null,null,"",null,null,null,"","","","",""]
[{"$f":"IFERROR(B386&\" \"&COUNTIFS($B$4:B386,B386),\"\")","v":" 0"},null,null,null,null,"",null,null,null,"","","","",""]
[{"$f":"IFERROR(B387&\" \"&COUNTIFS($B$4:B387,B387),\"\")","v":" 0"},null,null,null,null,"",null,null,null,"","","","",""]
[{"$f":"IFERROR(B388&\" \"&COUNTIFS($B$4:B388,B388),\"\")","v":" 0"},null,null,null,null,{"$f":"IFERROR(VLOOKUP(E388,data_guru,3,FALSE),\"\")","v":""},null,null,null,"","",{"$f":"IFERROR(VLOOKUP(B388,data_kas3,4,FALSE),\"\")","v":""},"",""]
[{"$f":"IFERROR(B389&\" \"&COUNTIFS($B$4:B389,B389),\"\")","v":" 0"},null,null,null,null,"",null,null,null,"","","","",""]
[{"$f":"IFERROR(B390&\" \"&COUNTIFS($B$4:B390,B390),\"\")","v":" 0"},null,null,null,null,"",null,null,null,"","","","",""]
[{"$f":"IFERROR(B391&\" \"&COUNTIFS($B$4:B391,B391),\"\")","v":" 0"},null,null,null,null,"",null,null,null,"","","","",""]
[{"$f":"IFERROR(B392&\" \"&COUNTIFS($B$4:B392,B392),\"\")","v":" 0"},null,null,null,null,"",null,null,null,"","","","",""]
[{"$f":"IFERROR(B393&\" \"&COUNTIFS($B$4:B393,B393),\"\")","v":" 0"},null,null,null,null,"",null,null,null,"","","","",""]
[{"$f":"IFERROR(B394&\" \"&COUNTIFS($B$4:B394,B394),\"\")","v":" 0"},null,null,null,null,"",null,null,null,"","","","",""]
[{"$f":"IFERROR(B395&\" \"&COUNTIFS($B$4:B395,B395),\"\")","v":" 0"},null,null,null,null,"",null,null,null,"","","","",""]
[{"$f":"IFERROR(B396&\" \"&COUNTIFS($B$4:B396,B396),\"\")","v":" 0"},null,null,null,null,"",null,null,null,"","","","",""]
[{"$f":"IFERROR(B397&\" \"&COUNTIFS($B$4:B397,B397),\"\")","v":" 0"},null,null,null,null,"",null,null,null,"","","","",""]
[{"$f":"IFERROR(B398&\" \"&COUNTIFS($B$4:B398,B398),\"\")","v":" 0"},null,null,null,null,"",null,null,null,"","","","",""]
[{"$f":"IFERROR(B399&\" \"&COUNTIFS($B$4:B399,B399),\"\")","v":" 0"},null,null,null,null,"",null,null,null,"","","","",""]
[{"$f":"IFERROR(B400&\" \"&COUNTIFS($B$4:B400,B400),\"\")","v":" 0"},null,null,null,null,"",null,null,null,"","","","",""]
[{"$f":"IFERROR(B401&\" \"&COUNTIFS($B$4:B401,B401),\"\")","v":" 0"},null,null,null,null,"",null,null,null,"","","","",""]
[{"$f":"IFERROR(B402&\" \"&COUNTIFS($B$4:B402,B402),\"\")","v":" 0"},null,null,null,null,"",null,null,null,"","","","",""]
[{"$f":"IFERROR(B403&\" \"&COUNTIFS($B$4:B403,B403),\"\")","v":" 0"},null,null,null,null,"",null,null,null,"","","","",""]
[{"$f":"IFERROR(B404&\" \"&COUNTIFS($B$4:B404,B404),\"\")","v":" 0"},null,null,null,null,"",null,null,null,"","","","",""]
[{"$f":"IFERROR(B405&\" \"&COUNTIFS($B$4:B405,B405),\"\")","v":" 0"},null,null,null,null,"",null,null,null,"","","","",""]
[{"$f":"IFERROR(B406&\" \"&COUNTIFS($B$4:B406,B406),\"\")","v":" 0"},null,null,null,null,"",null,null,null,"","","","",""]
[{"$f":"IFERROR(B407&\" \"&COUNTIFS($B$4:B407,B407),\"\")","v":" 0"},null,null,null,null,"",null,null,null,"","","","",""]
[{"$f":"IFERROR(B408&\" \"&COUNTIFS($B$4:B408,B408),\"\")","v":" 0"},null,null,null,null,"",null,null,null,"","","","",""]
[{"$f":"IFERROR(B409&\" \"&COUNTIFS($B$4:B409,B409),\"\")","v":" 0"},null,null,null,null,"",null,null,null,"","","","",""]
[{"$f":"IFERROR(B410&\" \"&COUNTIFS($B$4:B410,B410),\"\")","v":" 0"},null,null,null,null,"",null,null,null,"","","","",""]
[{"$f":"IFERROR(B411&\" \"&COUNTIFS($B$4:B411,B411),\"\")","v":" 0"},null,null,null,null,"",null,null,null,"","","","",""]
[{"$f":"IFERROR(B412&\" \"&COUNTIFS($B$4:B412,B412),\"\")","v":" 0"},null,null,null,null,"",null,null,null,"","","","",""]
[{"$f":"IFERROR(B413&\" \"&COUNTIFS($B$4:B413,B413),\"\")","v":" 0"},null,null,null,null,"",null,null,null,"","","","",""]
[{"$f":"IFERROR(B414&\" \"&COUNTIFS($B$4:B414,B414),\"\")","v":" 0"},null,null,null,null,"",null,null,null,"","","","",""]
[{"$f":"IFERROR(B415&\" \"&COUNTIFS($B$4:B415,B415),\"\")","v":" 0"},null,null,null,null,"",null,null,null,"","","","",""]
[{"$f":"IFERROR(B416&\" \"&COUNTIFS($B$4:B416,B416),\"\")","v":" 0"},null,null,null,null,"",null,null,null,"","","","",""]
[{"$f":"IFERROR(B417&\" \"&COUNTIFS($B$4:B417,B417),\"\")","v":" 0"},null,null,null,null,"",null,null,null,"","","","",""]
[{"$f":"IFERROR(B418&\" \"&COUNTIFS($B$4:B418,B418),\"\")","v":" 0"},null,null,null,null,"",null,null,null,"","","","",""]
[{"$f":"IFERROR(B419&\" \"&COUNTIFS($B$4:B419,B419),\"\")","v":" 0"},null,null,null,null,"",null,null,null,"","","","",""]
[{"$f":"IFERROR(B420&\" \"&COUNTIFS($B$4:B420,B420),\"\")","v":" 0"},null,null,null,null,"",null,null,null,"","","","",""]
[{"$f":"IFERROR(B421&\" \"&COUNTIFS($B$4:B421,B421),\"\")","v":" 0"},null,null,null,null,"",null,null,null,"","","","",""]
[{"$f":"IFERROR(B422&\" \"&COUNTIFS($B$4:B422,B422),\"\")","v":" 0"},null,null,null,null,"",null,null,null,"","","","",""]
[{"$f":"IFERROR(B423&\" \"&COUNTIFS($B$4:B423,B423),\"\")","v":" 0"},null,null,null,null,"",null,null,null,"","","","",""]
[{"$f":"IFERROR(B424&\" \"&COUNTIFS($B$4:B424,B424),\"\")","v":" 0"},null,null,null,null,"",null,null,null,"","","","",""]
[{"$f":"IFERROR(B425&\" \"&COUNTIFS($B$4:B425,B425),\"\")","v":" 0"},null,null,null,null,"",null,null,null,"","","","",""]
[{"$f":"IFERROR(B426&\" \"&COUNTIFS($B$4:B426,B426),\"\")","v":" 0"},null,null,null,null,"",null,null,null,"","","","",""]
[{"$f":"IFERROR(B427&\" \"&COUNTIFS($B$4:B427,B427),\"\")","v":" 0"},null,null,null,null,"",null,null,null,"","","","",""]
[{"$f":"IFERROR(B428&\" \"&COUNTIFS($B$4:B428,B428),\"\")","v":" 0"},null,null,null,null,"",null,null,null,"","","","",""]
[{"$f":"IFERROR(B429&\" \"&COUNTIFS($B$4:B429,B429),\"\")","v":" 0"},null,null,null,null,"",null,null,null,"","","","",""]
[{"$f":"IFERROR(B430&\" \"&COUNTIFS($B$4:B430,B430),\"\")","v":" 0"},null,null,null,null,"",null,null,null,"","","","",""]
[{"$f":"IFERROR(B431&\" \"&COUNTIFS($B$4:B431,B431),\"\")","v":" 0"},null,null,null,null,"",null,null,null,"","","","",""]
[{"$f":"IFERROR(B432&\" \"&COUNTIFS($B$4:B432,B432),\"\")","v":" 0"},null,null,null,null,"",null,null,null,"","","","",""]
[{"$f":"IFERROR(B433&\" \"&COUNTIFS($B$4:B433,B433),\"\")","v":" 0"},null,null,null,null,"",null,null,null,"","","","",""]
[{"$f":"IFERROR(B434&\" \"&COUNTIFS($B$4:B434,B434),\"\")","v":" 0"},null,null,null,null,"",null,null,null,"","","","",""]
[{"$f":"IFERROR(B435&\" \"&COUNTIFS($B$4:B435,B435),\"\")","v":" 0"},null,null,null,null,"",null,null,null,"","","","",""]
[{"$f":"IFERROR(B436&\" \"&COUNTIFS($B$4:B436,B436),\"\")","v":" 0"},null,null,null,null,"",null,null,null,"","","","",""]
[{"$f":"IFERROR(B437&\" \"&COUNTIFS($B$4:B437,B437),\"\")","v":" 0"},null,null,null,null,"",null,null,null,"","","","",""]
[{"$f":"IFERROR(B438&\" \"&COUNTIFS($B$4:B438,B438),\"\")","v":" 0"},null,null,null,null,"",null,null,null,"","","","",""]
[{"$f":"IFERROR(B439&\" \"&COUNTIFS($B$4:B439,B439),\"\")","v":" 0"},null,null,null,null,"",null,null,null,"","","","",""]
[{"$f":"IFERROR(B440&\" \"&COUNTIFS($B$4:B440,B440),\"\")","v":" 0"},null,null,null,null,"",null,null,null,"","","","",""]
[{"$f":"IFERROR(B441&\" \"&COUNTIFS($B$4:B441,B441),\"\")","v":" 0"},null,null,null,null,"",null,null,null,"","","","",""]
[{"$f":"IFERROR(B442&\" \"&COUNTIFS($B$4:B442,B442),\"\")","v":" 0"},null,null,null,null,"",null,null,null,"","","","",""]
[{"$f":"IFERROR(B443&\" \"&COUNTIFS($B$4:B443,B443),\"\")","v":" 0"},null,null,null,null,"",null,null,null,{"$f":"IFERROR(VLOOKUP(B443,data_kas3,12,FALSE),\"\")","v":""},{"$f":"IFERROR(VLOOKUP(B443,data_kas3,3,FALSE),\"\")","v":""},"",{"$f":"IFERROR(VLOOKUP(B443,data_kas3,5,FALSE),\"\")","v":""},""]
[{"$f":"IFERROR(B444&\" \"&COUNTIFS($B$4:B444,B444),\"\")","v":" 0"},null,null,null,null,"",null,null,null,"","","","",{"$f":"IF(K444=\"\",\"\",K444*M444)","v":""}]
[{"$f":"IFERROR(B445&\" \"&COUNTIFS($B$4:B445,B445),\"\")","v":" 0"},null,null,null,null,"",null,null,null,"","","","",""]
[{"$f":"IFERROR(B446&\" \"&COUNTIFS($B$4:B446,B446),\"\")","v":" 0"},null,null,null,null,"",null,null,null,"","","","",""]
[{"$f":"IFERROR(B447&\" \"&COUNTIFS($B$4:B447,B447),\"\")","v":" 0"},null,null,null,null,"",null,null,null,"","","","",""]
[{"$f":"IFERROR(B448&\" \"&COUNTIFS($B$4:B448,B448),\"\")","v":" 0"},null,null,null,null,"",null,null,null,"","","","",""]
[{"$f":"IFERROR(B449&\" \"&COUNTIFS($B$4:B449,B449),\"\")","v":" 0"},null,null,null,null,"",null,null,null,"","","","",""]
[{"$f":"IFERROR(B450&\" \"&COUNTIFS($B$4:B450,B450),\"\")","v":" 0"},null,null,null,null,"",null,null,null,"","","","",""]
[{"$f":"IFERROR(B451&\" \"&COUNTIFS($B$4:B451,B451),\"\")","v":" 0"},null,null,null,null,"",null,null,null,"","","","",""]
[{"$f":"IFERROR(B452&\" \"&COUNTIFS($B$4:B452,B452),\"\")","v":" 0"},null,null,null,null,{"$f":"IFERROR(VLOOKUP(E452,data_guru,3,FALSE),\"\")","v":""},null,null,null,"","",{"$f":"IFERROR(VLOOKUP(B452,data_kas3,4,FALSE),\"\")","v":""},"",""]
[{"$f":"IFERROR(B453&\" \"&COUNTIFS($B$4:B453,B453),\"\")","v":" 0"},null,null,null,null,"",null,null,null,"","","","",""]
[{"$f":"IFERROR(B454&\" \"&COUNTIFS($B$4:B454,B454),\"\")","v":" 0"},null,null,null,null,"",null,null,null,"","","","",""]
[{"$f":"IFERROR(B455&\" \"&COUNTIFS($B$4:B455,B455),\"\")","v":" 0"},null,null,null,null,"",null,null,null,"","","","",""]
[{"$f":"IFERROR(B456&\" \"&COUNTIFS($B$4:B456,B456),\"\")","v":" 0"},null,null,null,null,"",null,null,null,"","","","",""]
[{"$f":"IFERROR(B457&\" \"&COUNTIFS($B$4:B457,B457),\"\")","v":" 0"},null,null,null,null,"",null,null,null,"","","","",""]
[{"$f":"IFERROR(B458&\" \"&COUNTIFS($B$4:B458,B458),\"\")","v":" 0"},null,null,null,null,"",null,null,null,"","","","",""]
[{"$f":"IFERROR(B459&\" \"&COUNTIFS($B$4:B459,B459),\"\")","v":" 0"},null,null,null,null,"",null,null,null,"","","","",""]
[{"$f":"IFERROR(B460&\" \"&COUNTIFS($B$4:B460,B460),\"\")","v":" 0"},null,null,null,null,"",null,null,null,"","","","",""]
[{"$f":"IFERROR(B461&\" \"&COUNTIFS($B$4:B461,B461),\"\")","v":" 0"},null,null,null,null,"",null,null,null,"","","","",""]
[{"$f":"IFERROR(B462&\" \"&COUNTIFS($B$4:B462,B462),\"\")","v":" 0"},null,null,null,null,"",null,null,null,"","","","",""]
[{"$f":"IFERROR(B463&\" \"&COUNTIFS($B$4:B463,B463),\"\")","v":" 0"},null,null,null,null,"",null,null,null,"","","","",""]
[{"$f":"IFERROR(B464&\" \"&COUNTIFS($B$4:B464,B464),\"\")","v":" 0"},null,null,null,null,"",null,null,null,"","","","",""]
[{"$f":"IFERROR(B465&\" \"&COUNTIFS($B$4:B465,B465),\"\")","v":" 0"},null,null,null,null,"",null,null,null,"","","","",""]
[{"$f":"IFERROR(B466&\" \"&COUNTIFS($B$4:B466,B466),\"\")","v":" 0"},null,null,null,null,"",null,null,null,"","","","",""]
[{"$f":"IFERROR(B467&\" \"&COUNTIFS($B$4:B467,B467),\"\")","v":" 0"},null,null,null,null,"",null,null,null,"","","","",""]
[{"$f":"IFERROR(B468&\" \"&COUNTIFS($B$4:B468,B468),\"\")","v":" 0"},null,null,null,null,"",null,null,null,"","","","",""]
[{"$f":"IFERROR(B469&\" \"&COUNTIFS($B$4:B469,B469),\"\")","v":" 0"},null,null,null,null,"",null,null,null,"","","","",""]
[{"$f":"IFERROR(B470&\" \"&COUNTIFS($B$4:B470,B470),\"\")","v":" 0"},null,null,null,null,"",null,null,null,"","","","",""]
[{"$f":"IFERROR(B471&\" \"&COUNTIFS($B$4:B471,B471),\"\")","v":" 0"},null,null,null,null,"",null,null,null,"","","","",""]
[{"$f":"IFERROR(B472&\" \"&COUNTIFS($B$4:B472,B472),\"\")","v":" 0"},null,null,null,null,"",null,null,null,"","","","",""]
[{"$f":"IFERROR(B473&\" \"&COUNTIFS($B$4:B473,B473),\"\")","v":" 0"},null,null,null,null,"",null,null,null,"","","","",""]
[{"$f":"IFERROR(B474&\" \"&COUNTIFS($B$4:B474,B474),\"\")","v":" 0"},null,null,null,null,"",null,null,null,"","","","",""]
[{"$f":"IFERROR(B475&\" \"&COUNTIFS($B$4:B475,B475),\"\")","v":" 0"},null,null,null,null,"",null,null,null,"","","","",""]
[{"$f":"IFERROR(B476&\" \"&COUNTIFS($B$4:B476,B476),\"\")","v":" 0"},null,null,null,null,"",null,null,null,"","","","",""]
[{"$f":"IFERROR(B477&\" \"&COUNTIFS($B$4:B477,B477),\"\")","v":" 0"},null,null,null,null,"",null,null,null,"","","","",""]
[{"$f":"IFERROR(B478&\" \"&COUNTIFS($B$4:B478,B478),\"\")","v":" 0"},null,null,null,null,"",null,null,null,"","","","",""]
[{"$f":"IFERROR(B479&\" \"&COUNTIFS($B$4:B479,B479),\"\")","v":" 0"},null,null,null,null,"",null,null,null,"","","","",""]
[{"$f":"IFERROR(B480&\" \"&COUNTIFS($B$4:B480,B480),\"\")","v":" 0"},null,null,null,null,"",null,null,null,"","","","",""]
[{"$f":"IFERROR(B481&\" \"&COUNTIFS($B$4:B481,B481),\"\")","v":" 0"},null,null,null,null,"",null,null,null,"","","","",""]
[{"$f":"IFERROR(B482&\" \"&COUNTIFS($B$4:B482,B482),\"\")","v":" 0"},null,null,null,null,"",null,null,null,"","","","",""]
[{"$f":"IFERROR(B483&\" \"&COUNTIFS($B$4:B483,B483),\"\")","v":" 0"},null,null,null,null,"",null,null,null,"","","","",""]
[{"$f":"IFERROR(B484&\" \"&COUNTIFS($B$4:B484,B484),\"\")","v":" 0"},null,null,null,null,"",null,null,null,"","","","",""]
[{"$f":"IFERROR(B485&\" \"&COUNTIFS($B$4:B485,B485),\"\")","v":" 0"},null,null,null,null,"",null,null,null,"","","","",""]
[{"$f":"IFERROR(B486&\" \"&COUNTIFS($B$4:B486,B486),\"\")","v":" 0"},null,null,null,null,"",null,null,null,"","","","",""]
[{"$f":"IFERROR(B487&\" \"&COUNTIFS($B$4:B487,B487),\"\")","v":" 0"},null,null,null,null,"",null,null,null,"","","","",""]
[{"$f":"IFERROR(B488&\" \"&COUNTIFS($B$4:B488,B488),\"\")","v":" 0"},null,null,null,null,"",null,null,null,"","","","",""]
[{"$f":"IFERROR(B489&\" \"&COUNTIFS($B$4:B489,B489),\"\")","v":" 0"},null,null,null,null,"",null,null,null,"","","","",""]
[{"$f":"IFERROR(B490&\" \"&COUNTIFS($B$4:B490,B490),\"\")","v":" 0"},null,null,null,null,"",null,null,null,"","","","",""]
[{"$f":"IFERROR(#REF!&\" \"&COUNTIFS(#REF!,#REF!),\"\")","v":""},"end","End",null,"end","end","end","end","end","end","end","end","end","end"]

{"sheet":"KUITANSI UMUM","index":4,"n_rows":56,"n_cols":25,"rows_kept":56,"cut":false,"hidden":false,"merged":[[1,4,4,10],[1,13,1,18],[2,13,2,18],[3,13,3,18],[4,13,4,18],[47,11,47,13],[9,7,9,18],[45,7,45,9],[48,5,48,8],[10,7,10,18],[48,16,48,18],[46,4,46,18],[49,15,49,16],[55,5,55,8],[49,10,49,12],[49,5,49,8],[54,5,54,8],[54,10,54,13],[55,10,55,13]]}
[]
[null,null,null,null,"KUITANSI PEMBAYARAN",null,null,null,null,null,null,"Nomor",null,{"$f":"V10&\"/BOSP/\"&'DATA UMUM'!D9","v":"BPU05/BOSP/2024"},null,null,null,null,null,null,"Pilih BPU dengan tombol panah, klik tombol PROSES"]
[null,null,null,null,null,null,null,null,null,null,null,"Tahun Anggaran",null,{"$f":"'DATA UMUM'!D9","v":2024},null,null,null,null,null,null,"Selalu klik tombol PROSES sebelum print"]
[null,null,null,null,null,null,null,null,null,null,null,"Kode Kegiatan",null,{"$f":"IFERROR(VLOOKUP(V10,DATA_KAS,4,FALSE),\"\")","v":"06.05.08."},null,null,null,null,null,null,"Nomor BPU bisa diketik manual, untuk mencari BPU"]
[null,null,null,null,null,null,null,null,null,null,null,"Kode Rekening",null,{"$f":"IFERROR(VLOOKUP(V10,DATA_KAS,5,FALSE),\"\")","v":"5.1.02.01.01\n.0024"}]
[null,{"$f":"IF(E6=0,0,1)","v":1},null,null,{"$f":"IFERROR(VLOOKUP(V10,DATA_KAS,15,FALSE),0)","v":"Toko Senjata Tenten"}]
[null,{"$f":"IF(E7=\"\",0,1)","v":1},null,null,{"$f":"IFERROR(VLOOKUP(V10,DATA_KAS,17,FALSE),0)","v":"Jalan Ninja Nomor 2, Desa Konohagakure, Negara Api"}]
[null,{"$f":"IF(E8=\"\",0,1)","v":1},null,null,{"$f":"IFERROR(VLOOKUP(V10,DATA_KAS,16,FALSE),0)","v":"005003"}]
[null,1,null,null,"Sudah diterima dari",null,null,{"$f":"\"Kepala \"&'DATA UMUM'!D2","v":"Kepala SD Ninja 01 Konoha"},null,null,null,null,null,null,null,null,null,null,null,null,"NO","NO. BUKTI",null,null,{"$f":"IFERROR(VLOOKUP(V10,DATA_KAS,14,FALSE),\"\")","v":0}]
[null,1,null,null,"Uang sejumlah",null,null,{"$f":"IFERROR(PROPER(IF( H46=0,\"nol\",IF( H46<0,\"minus \",\"\")&SUBSTITUTE(TRIM(SUBSTITUTE(SUBSTITUTE(SUBSTITUTE(SUBSTITUTE(SUBSTITUTE(SUBSTITUTE(SUBSTITUTE(SUBSTITUTE(SUBSTITUTE(SUBSTITUTE(SUBSTITUTE(SUBSTITUTE(SUBSTITUTE(SUBSTITUTE(SUBSTITUTE(SUBSTITUTE(SUBSTITUTE(SUBSTITUTE(SUBSTITUTE(SUBSTITUTE(SUBSTITUTE(SUBSTITUTE(SUBSTITUTE(SUBSTITUTE(IF(--MID(TEXT(ABS( H46),\"000000000000000\"),1,3)=0,\"\",MID(TEXT(ABS( H46),\"000000000000000\"),1,1)&\" ratus \"&MID(TEXT(ABS( H46),\"000000000000000\"),2,1)&\" puluh \"&MID(TEXT(ABS( H46),\"000000000000000\"),3,1)&\" trilyun \")&IF(--MID(TEXT(ABS( H46),\"000000000000000\"),4,3)=0,\"\",MID(TEXT(ABS( H46),\"000000000000000\"),4,1)&\" ratus \"&MID(TEXT(ABS( H46),\"000000000000000\"),5,1)&\" puluh \"&MID(TEXT(ABS( H46),\"000000000000000\"),6,1)&\" milyar \")&IF(--MID(TEXT(ABS( H46),\"000000000000000\"),7,3)=0,\"\",MID(TEXT(ABS( H46),\"000000000000000\"),7,1)&\" ratus \"&MID(TEXT(ABS( H46),\"000000000000000\"),8,1)&\" puluh \"&MID(TEXT(ABS( H46),\"000000000000000\"),9,1)&\" juta \")&IF(--MID(TEXT(ABS( H46),\"000000000000000\"),10,3)=0,\"\",IF(--MID(TEXT(ABS( H46),\"000000000000000\"),10,3)=1,\"*\",MID(TEXT(ABS( H46),\"000000000000000\"),10,1)&\" ratus \"&MID(TEXT(ABS( H46),\"000000000000000\"),11,1)&\" puluh \")&MID(TEXT(ABS( H46),\"000000000000000\"),12,1)&\" ribu \")&IF(--MID(TEXT(ABS( H46),\"000000000000000\"),13,3)=0,\"\",MID(TEXT(ABS( H46),\"000000000000000\"),13,1)&\" ratus \"&MID(TEXT(ABS( H46),\"000000000000000\"),14,1)&\" puluh \"&MID(TEXT(ABS( H46),\"000000000000000\"),15,1)),1,\"satu\"),2,\"dua\"),3,\"tiga\"),4,\"empat\"),5,\"lima\"),6,\"enam\"),7,\"tujuh\"),8,\"delapan\"),9,\"sembilan\"),\"0 ratus\",\"\"),\"0 puluh\",\"\"),\"satu puluh 0\",\"sepuluh\"),\"satu puluh satu\",\"sebelas\"),\"satu puluh dua\",\"duabelas\"),\"satu puluh tiga\",\"tigabelas\"),\"satu puluh empat\",\"empatbelas\"),\"satu puluh lima\",\"limabelas\"),\"satu puluh enam\",\"enambelas\"),\"satu puluh tujuh\",\"tujuhbelas\"),\"satu puluh delapan\",\"delapanbelas\"),\"satu puluh sembilan\",\"sembilanbelas\"),\"satu ratus\",\"seratus\"),\"*satu ribu\",\"seribu\"),0,\"\")),\" \",\" \")))&\" \" &\"Rupiah\",\"\")","v":"Satu Juta Sembilan Ratus Delapan Puluh Delapan Ribu Rupiah"},null,null,null,null,null,null,null,null,null,null,null,null,5,{"$f":"\"BPU\"&TEXT(U10,\"00\")","v":"BPU05"}]
[null,1,null,null,"Untuk pembayaran",null,null,{"$f":"IFERROR(VLOOKUP(V10,DATA_KAS,7,FALSE),\"\")","v":"Pembelian ATK"}]
[null,0,null,null,null,null,null,{"$f":"IF(Y9=2,\"Dengan rincian sebagai berikut:\",IF(Y9=1,\"(daftar terlampir)\",\"\"))","v":""}]
[{"$f":"$V$10&\" \"&D13","v":"BPU05 1"},0,{"$f":"D13","v":1},1,null,null,{"$f":"IFERROR(IF(Q13<>\"\",COUNTA($Q13:Q$13),\"\"),\"\")","v":1},{"$f":"IFERROR(VLOOKUP(A13,DATA_ITEM,5,FALSE),\"\")","v":"Penghapus Whiteboard besar GM"},null,null,null,null,":",{"$f":"IFERROR(VLOOKUP(A13,DATA_ITEM,8,FALSE),\"\")","v":12},{"$f":"IFERROR(VLOOKUP(A13,DATA_ITEM,9,FALSE),\"\")","v":"pcs"},"@",{"$f":"IFERROR(VLOOKUP(A13,DATA_ITEM,10,FALSE),\"\")","v":16500},"=",{"$f":"IFERROR(VLOOKUP(A13,DATA_ITEM,11,FALSE),\"\")","v":198000}]
[{"$f":"$V$10&\" \"&D14","v":"BPU05 2"},0,{"$f":"D14","v":2},2,null,null,{"$f":"IFERROR(IF(H14<>\"\",COUNTA($H$13:H14),\"\"),\"\")","v":2},"Kertas HVS Folio",null,null,null,null,":",10,{"$f":"IFERROR(VLOOKUP(A14,DATA_ITEM,9,FALSE),\"\")","v":"rim"},"@",90000,"=",900000]
["BPU05 3",0,3,3,null,null,{"$f":"IFERROR(IF(H15<>\"\",COUNTA($H$13:H15),\"\"),\"\")","v":3},"Catridge Printer IP 2770 810 Hitam- IP 2770 810 Hitam",null,null,null,null,":",1,{"$f":"IFERROR(VLOOKUP(A15,DATA_ITEM,9,FALSE),\"\")","v":"unit"},"@",300000,"=",300000]
["BPU05 4",0,4,4,null,null,{"$f":"IFERROR(IF(H16<>\"\",COUNTA($H$13:H16),\"\"),\"\")","v":4},"Spidol Whiteboard Warna Hitam BG 12 Snowman",null,null,null,null,":",24,"buah","@",10000,"=",240000]
["BPU05 5",0,5,5,null,null,{"$f":"IFERROR(IF(H17<>\"\",COUNTA($H$13:H17),\"\"),\"\")","v":5},"Catridge Printer IP 2770 811 Warna- IP 2770 811 Warna",null,null,null,null,":",1,"unit","@",350000,"=",350000]
["BPU05 6",0,{"$f":"D18","v":6},6,null,null,{"$f":"IFERROR(IF(H18<>\"\",COUNTA($H$13:H18),\"\"),\"\")","v":""},"",null,null,null,null,":","","","@","","=",""]
["BPU05 7",0,{"$f":"D19","v":7},7,null,null,{"$f":"IFERROR(IF(H19<>\"\",COUNTA($H$13:H19),\"\"),\"\")","v":""},"",null,null,null,null,":","","","@","","=",""]
["BPU05 8",0,8,8,null,null,{"$f":"IFERROR(IF(H20<>\"\",COUNTA($H$13:H20),\"\"),\"\")","v":""},"",null,null,null,null,":","","","@","","=",""]
["BPU05 9",0,9,9,null,null,{"$f":"IFERROR(IF(H21<>\"\",COUNTA($H$13:H21),\"\"),\"\")","v":""},"",null,null,null,null,":","","","@","","=",""]
["BPU05 10",0,10,10,null,null,{"$f":"IFERROR(IF(H22<>\"\",COUNTA($H$13:H22),\"\"),\"\")","v":""},"",null,null,null,null,":","","","@","","=",""]
["BPU05 11",0,11,11,null,null,{"$f":"IFERROR(IF(H23<>\"\",COUNTA($H$13:H23),\"\"),\"\")","v":""},"",null,null,null,null,":","","","@","","=",""]
["BPU05 12",0,12,12,null,null,{"$f":"IFERROR(IF(H24<>\"\",COUNTA($H$13:H24),\"\"),\"\")","v":""},"",null,null,null,null,":","","","@","","=",""]
["BPU05 13",0,13,13,null,null,{"$f":"IFERROR(IF(H25<>\"\",COUNTA($H$13:H25),\"\"),\"\")","v":""},"",null,null,null,null,":","","","@","","=",""]
["BPU05 14",0,14,14,null,null,{"$f":"IFERROR(IF(H26<>\"\",COUNTA($H$13:H26),\"\"),\"\")","v":""},"",null,null,null,null,":","","","@","","=",""]
["BPU05 15",0,15,15,null,null,{"$f":"IFERROR(IF(H27<>\"\",COUNTA($H$13:H27),\"\"),\"\")","v":""},"",null,null,null,null,":","","","@","","=",""]
["BPU05 16",0,16,16,null,null,{"$f":"IFERROR(IF(H28<>\"\",COUNTA($H$13:H28),\"\"),\"\")","v":""},"",null,null,null,null,":","","","@","","=",""]
["BPU05 17",0,17,17,null,null,{"$f":"IFERROR(IF(H29<>\"\",COUNTA($H$13:H29),\"\"),\"\")","v":""},"",null,null,null,null,":","","","@","","=",""]
["BPU05 18",0,18,18,null,null,{"$f":"IFERROR(IF(H30<>\"\",COUNTA($H$13:H30),\"\"),\"\")","v":""},"",null,null,null,null,":","","","@","","=",""]
["BPU05 19",0,19,19,null,null,{"$f":"IFERROR(IF(H31<>\"\",COUNTA($H$13:H31),\"\"),\"\")","v":""},"",null,null,null,null,":","","","@","","=",""]
["BPU05 20",0,20,20,null,null,{"$f":"IFERROR(IF(H32<>\"\",COUNTA($H$13:H32),\"\"),\"\")","v":""},"",null,null,null,null,":","","","@","","=",""]
["BPU05 21",0,21,21,null,null,{"$f":"IFERROR(IF(H33<>\"\",COUNTA($H$13:H33),\"\"),\"\")","v":""},"",null,null,null,null,":","","","@","","=",""]
["BPU05 22",0,22,22,null,null,{"$f":"IFERROR(IF(H34<>\"\",COUNTA($H$13:H34),\"\"),\"\")","v":""},"",null,null,null,null,":","","","@","","=",""]
["BPU05 23",0,23,23,null,null,{"$f":"IFERROR(IF(H35<>\"\",COUNTA($H$13:H35),\"\"),\"\")","v":""},"",null,null,null,null,":","","","@","","=",""]
["BPU05 24",0,24,24,null,null,{"$f":"IFERROR(IF(H36<>\"\",COUNTA($H$13:H36),\"\"),\"\")","v":""},"",null,null,null,null,":","","","@","","=",""]
["BPU05 25",0,25,25,null,null,{"$f":"IFERROR(IF(H37<>\"\",COUNTA($H$13:H37),\"\"),\"\")","v":""},"",null,null,null,null,":","","","@","","=",""]
["BPU05 26",0,26,26,null,null,{"$f":"IFERROR(IF(H38<>\"\",COUNTA($H$13:H38),\"\"),\"\")","v":""},"",null,null,null,null,":","","","@","","=",""]
["BPU05 27",0,27,27,null,null,{"$f":"IFERROR(IF(H39<>\"\",COUNTA($H$13:H39),\"\"),\"\")","v":""},"",null,null,null,null,":","","","@","","=",""]
["BPU05 28",0,28,28,null,null,{"$f":"IFERROR(IF(H40<>\"\",COUNTA($H$13:H40),\"\"),\"\")","v":""},"",null,null,null,null,":","","","@","","=",""]
["BPU05 29",0,29,29,null,null,{"$f":"IFERROR(IF(H41<>\"\",COUNTA($H$13:H41),\"\"),\"\")","v":""},"",null,null,null,null,":","","","@","","=",""]
["BPU05 30",0,30,30,null,null,{"$f":"IFERROR(IF(H42<>\"\",COUNTA($H$13:H42),\"\"),\"\")","v":""},"",null,null,null,null,":","","","@","","=",""]
[null,0,null,null,null,null,null,null,null,null,null,null,null,null,null,null,"Jumlah",null,{"$f":"SUM(S13:S42)","v":1988000},null,null,null,null,null,{"$f":"IF(Y9=2,\"2\",\"\")","v":""}]
[null,1,null,null,"Dibebankan pada",null,null,{"$f":"\"Dana \"&'DATA UMUM'!D8&\" TA. \"&'DATA UMUM'!D9","v":"Dana BOSP Tahap I TA. 2024"}]
[null,1]
[null,1,null,null,"Jumlah",null,null,{"$f":"S43","v":1988000}]
[null,1,null,null,"LUNAS DIBAYAR"]
[null,1,null,null,null,null,null,null,null,null,"Tanggal,",{"$f":"IFERROR(VLOOKUP(V10,DATA_KAS,3,FALSE),\"\")","v":"2024-04-03"}]
[null,1,null,null,null,"SETUJU DIBAYAR OLEH",null,null,null,null,null,null,null,null,null,{"$f":"IFERROR(VLOOKUP(V10,DATA_KAS,13,FALSE),\"\")&\",\"","v":"Kembayan,"},{"$f":"L48","v":"2024-04-03"}]
[null,1,null,null,null,"KEPALA SEKOLAH",null,null,null,null,"BENDAHARA BOS",null,null,null,null,"YANG MENERIMA"]
[null,1]
[null,1]
[null,1]
[null,1]
[null,1,null,null,null,{"$f":"'DATA UMUM'!D4","v":"Shikamaru, S.Pd."},null,null,null,null,{"$f":"'DATA UMUM'!D6","v":"Temari, S.Pd."}]
[null,1,null,null,null,{"$f":"\"NIP. \"&'DATA UMUM'!D5","v":"NIP. 012611"},null,null,null,null,{"$f":"\"NIP. \"&'DATA UMUM'!D7","v":"NIP. 53-004"}]

{"sheet":"SPMB","index":5,"n_rows":63,"n_cols":29,"rows_kept":63,"cut":false,"hidden":false,"merged":[[54,10,54,11],[59,10,59,12],[60,10,60,12],[49,6,49,14],[53,14,53,15],[7,4,7,15],[8,4,8,15],[15,4,15,15],[10,4,10,15],[1,4,1,15],[2,4,2,15],[3,4,3,15],[4,4,4,15],[5,4,5,15],[6,4,6,15]]}
[]
[null,null,null,null,"PEMERINTAH NEGARA API",null,null,null,null,null,null,null,null,null,null,null,null,"Pilih BPU dengan tombol panah, klik tombol PROSES"]
[null,null,null,null,"DINAS KENINJAAN",null,null,null,null,null,null,null,null,null,null,null,null,"Selalu klik tombol PROSES sebelum print"]
[null,null,null,null,"KOORDINATOR WILAYAH KONOHAGAKURE",null,null,null,null,null,null,null,null,null,null,null,null,"Nomor BPU bisa diketik manual, untuk mencari BPU"]
[null,null,null,null,{"$f":"UPPER('DATA UMUM'!D2)","v":"SD NINJA 01 KONOHA"}]
[null,{"$f":"IF(E6=0,0,1)","v":1},null,null,{"$f":"'DATA UMUM'!D10&\". NPSN: 30102196\"","v":"Desa Konohagakure, Negara Api. 666. NPSN: 30102196"}]
[null,{"$f":"IF(E7=\"\",0,1)","v":1},null,null,{"$f":"'DATA UMUM'!D11","v":"sdninja@konohagaku.re"}]
[null,{"$f":"IF(E8=\"\",0,1)","v":1},null,null,"SURAT PERINTAH MEMBELI BARANG"]
[null,1,null,null,"Nomor: 422/….../SD.17/Adm/2024",null,null,null,null,null,null,null,null,null,null,null,null,"NO","NO. BUKTI",null,null,{"$f":"IFERROR(VLOOKUP(S10,DATA_KAS,14,FALSE),\"\")","v":0}]
[null,1,null,null,null,null,null,null,null,null,null,null,null,null,null,null,null,5,{"$f":"\"BPU\"&TEXT(R10,\"00\")","v":"BPU05"}]
[null,1,null,null,"Yang bertandatangan di bawah ini kepala sekolah SD Negeri 17 Sungai Merah menugaskan:"]
[null,1,null,null,"nama",":",{"$f":"'DATA UMUM'!D6","v":"Temari, S.Pd."}]
[null,1,null,null,"NIP",":",{"$f":"'DATA UMUM'!D7","v":"53-004"}]
[null,1,null,null,"jabatan",":","Bendahara BOSP",null,null,null,null,null,null,null,null,null,null,null,null,null,null,null,null,null,null,null,null,null,{"$f":"240/2","v":120}]
[null,1,null,null,"unit kerja",":",{"$f":"'DATA UMUM'!D2","v":"SD Ninja 01 Konoha"}]
[null,1,null,null,{"$f":"\"untuk melakukan proses pengadaan barang dan jasa pada \"&IFERROR(VLOOKUP(A20,DATA_ITEM,14,FALSE),\"\")&\" dengan rincian sebagai berikut\"","v":"untuk melakukan proses pengadaan barang dan jasa pada Toko Senjata Tenten dengan rincian sebagai berikut"}]
[null,1,null,null,"Nama Kegiatan",null,":",{"$f":"IFERROR(VLOOKUP(S10,DATA_KAS,7,FALSE),\"\")","v":"Pembelian ATK"}]
[null,1]
[null,1,null,null,null,null,"No","Nama Barang",null,null,null,null,"Volume","Satuan","Harga","Jumlah"]
[{"$f":"$S$10&\" \"&D20","v":"BPU05 1"},{"$f":"IF(N20=0,\"0\",IF(G20:G20<>\"\",1,0))","v":1},{"$f":"D20","v":1},1,null,null,{"$f":"IFERROR(IF(O20<>\"\",COUNTA($O20:O$20),\"\"),\"\")","v":1},{"$f":"IFERROR(VLOOKUP(A20,DATA_ITEM,5,FALSE),\"\")","v":"Penghapus Whiteboard besar GM"},null,null,null,null,{"$f":"IFERROR(VLOOKUP(A20,DATA_ITEM,8,FALSE),\"\")","v":12},{"$f":"IFERROR(VLOOKUP(A20,DATA_ITEM,9,FALSE),\"\")","v":"pcs"},{"$f":"IFERROR(VLOOKUP(A20,DATA_ITEM,10,FALSE),\"\")","v":16500},{"$f":"IFERROR(VLOOKUP(A20,DATA_ITEM,11,FALSE),\"\")","v":198000}]
["BPU05 2",1,{"$f":"D21","v":2},2,null,null,{"$f":"IFERROR(IF(H21<>\"\",COUNTA($H$20:H21),\"\"),\"\")","v":2},{"$f":"IFERROR(VLOOKUP(A21,DATA_ITEM,5,FALSE),\"\")","v":"Kertas HVS Folio"},null,null,null,null,10,{"$f":"IFERROR(VLOOKUP(A21,DATA_ITEM,9,FALSE),\"\")","v":"rim"},90000,900000]
["BPU05 3",1,3,3,null,null,{"$f":"IFERROR(IF(H22<>\"\",COUNTA($H$20:H22),\"\"),\"\")","v":3},"Catridge Printer IP 2770 810 Hitam- IP 2770 810 Hitam",null,null,null,null,1,{"$f":"IFERROR(VLOOKUP(A22,DATA_ITEM,9,FALSE),\"\")","v":"unit"},300000,300000]
["BPU05 4",1,4,4,null,null,{"$f":"IFERROR(IF(H23<>\"\",COUNTA($H$20:H23),\"\"),\"\")","v":4},"Spidol Whiteboard Warna Hitam BG 12 Snowman",null,null,null,null,24,"buah",10000,240000]
["BPU05 5",1,5,5,null,null,{"$f":"IFERROR(IF(H24<>\"\",COUNTA($H$20:H24),\"\"),\"\")","v":5},"Catridge Printer IP 2770 811 Warna- IP 2770 811 Warna",null,null,null,null,1,"unit",350000,350000]
["BPU05 6",0,6,6,null,null,{"$f":"IFERROR(IF(H25<>\"\",COUNTA($H$20:H25),\"\"),\"\")","v":""},"",null,null,null,null,"","","",""]
["BPU05 7",0,7,7,null,null,{"$f":"IFERROR(IF(H26<>\"\",COUNTA($H$20:H26),\"\"),\"\")","v":""},"",null,null,null,null,"","","",""]
["BPU05 8",0,8,8,null,null,{"$f":"IFERROR(IF(H27<>\"\",COUNTA($H$20:H27),\"\"),\"\")","v":""},"",null,null,null,null,"","","",""]
["BPU05 9",0,9,9,null,null,{"$f":"IFERROR(IF(H28<>\"\",COUNTA($H$20:H28),\"\"),\"\")","v":""},"",null,null,null,null,"","","",""]
["BPU05 10",0,10,10,null,null,{"$f":"IFERROR(IF(H29<>\"\",COUNTA($H$20:H29),\"\"),\"\")","v":""},"",null,null,null,null,"","","",""]
["BPU05 11",0,11,11,null,null,{"$f":"IFERROR(IF(H30<>\"\",COUNTA($H$20:H30),\"\"),\"\")","v":""},"",null,null,null,null,"","","",""]
["BPU05 12",0,12,12,null,null,{"$f":"IFERROR(IF(H31<>\"\",COUNTA($H$20:H31),\"\"),\"\")","v":""},"",null,null,null,null,"","","",""]
["BPU05 13",0,13,13,null,null,{"$f":"IFERROR(IF(H32<>\"\",COUNTA($H$20:H32),\"\"),\"\")","v":""},"",null,null,null,null,"","","",""]
["BPU05 14",0,14,14,null,null,{"$f":"IFERROR(IF(H33<>\"\",COUNTA($H$20:H33),\"\"),\"\")","v":""},"",null,null,null,null,"","","",""]
["BPU05 15",0,15,15,null,null,{"$f":"IFERROR(IF(H34<>\"\",COUNTA($H$20:H34),\"\"),\"\")","v":""},"",null,null,null,null,"","","",""]
["BPU05 16",0,16,16,null,null,{"$f":"IFERROR(IF(H35<>\"\",COUNTA($H$20:H35),\"\"),\"\")","v":""},"",null,null,null,null,"","","",""]
["BPU05 17",0,17,17,null,null,{"$f":"IFERROR(IF(H36<>\"\",COUNTA($H$20:H36),\"\"),\"\")","v":""},"",null,null,null,null,"","","",""]
["BPU05 18",0,18,18,null,null,{"$f":"IFERROR(IF(H37<>\"\",COUNTA($H$20:H37),\"\"),\"\")","v":""},"",null,null,null,null,"","","",""]
["BPU05 19",0,19,19,null,null,{"$f":"IFERROR(IF(H38<>\"\",COUNTA($H$20:H38),\"\"),\"\")","v":""},"",null,null,null,null,"","","",""]
["BPU05 20",0,20,20,null,null,{"$f":"IFERROR(IF(H39<>\"\",COUNTA($H$20:H39),\"\"),\"\")","v":""},"",null,null,null,null,"","","",""]
["BPU05 21",0,21,21,null,null,{"$f":"IFERROR(IF(H40<>\"\",COUNTA($H$20:H40),\"\"),\"\")","v":""},"",null,null,null,null,"","","",""]
["BPU05 22",0,22,22,null,null,{"$f":"IFERROR(IF(H41<>\"\",COUNTA($H$20:H41),\"\"),\"\")","v":""},"",null,null,null,null,"","","",""]
["BPU05 23",0,23,23,null,null,{"$f":"IFERROR(IF(H42<>\"\",COUNTA($H$20:H42),\"\"),\"\")","v":""},"",null,null,null,null,"","","",""]
["BPU05 24",0,24,24,null,null,{"$f":"IFERROR(IF(H43<>\"\",COUNTA($H$20:H43),\"\"),\"\")","v":""},"",null,null,null,null,"","","",""]
["BPU05 25",0,25,25,null,null,{"$f":"IFERROR(IF(H44<>\"\",COUNTA($H$20:H44),\"\"),\"\")","v":""},"",null,null,null,null,"","","",""]
["BPU05 26",0,26,26,null,null,{"$f":"IFERROR(IF(H45<>\"\",COUNTA($H$20:H45),\"\"),\"\")","v":""},"",null,null,null,null,"","","",""]
["BPU05 27",0,27,27,null,null,{"$f":"IFERROR(IF(H46<>\"\",COUNTA($H$20:H46),\"\"),\"\")","v":""},"",null,null,null,null,"","","",""]
["BPU05 28",0,28,28,null,null,{"$f":"IFERROR(IF(H47<>\"\",COUNTA($H$20:H47),\"\"),\"\")","v":""},"",null,null,null,null,"","","",""]
["BPU05 29",0,29,29,null,null,{"$f":"IFERROR(IF(H48<>\"\",COUNTA($H$20:H48),\"\"),\"\")","v":""},"",null,null,null,null,"","","",""]
["BPU05 30",0,30,30,null,null,{"$f":"IFERROR(IF(H49<>\"\",COUNTA($H$20:H49),\"\"),\"\")","v":""},"",null,null,null,null,"","","",""]
[null,1,null,null,null,null,"Jumlah",null,null,null,null,null,null,null,null,{"$f":"SUM(P20:P49)","v":1988000},null,null,null,null,null,{"$f":"IF(V9=2,\"2\",\"\")","v":""}]
[null,1]
[null,1,null,null,"Demikian surat ini dibuat agar dapat digunakan sebagaimana mestinya, atas kerja samanya kami ucapkan terima kasih."]
[null,1]
[null,1,null,null,null,null,null,null,null,null,null,null,null,{"$f":"IFERROR(VLOOKUP(S10,DATA_KAS,13,FALSE),\"\")&\", \"","v":"Kembayan, "},{"$f":"IFERROR(VLOOKUP(S10,DATA_KAS,3,FALSE),\"\")","v":"2024-04-03"},null,null,"spmb tanggal pemesanan"]
[null,1,null,null,null,null,null,null,null,null,null,null,null,null,"KEPALA SEKOLAH"]
[null,1,null,null,null,null,null,null,null,null,null,null,null,null,{"$f":"'DATA UMUM'!D2","v":"SD Ninja 01 Konoha"}]
[null,1]
[null,1]
[null,1]
[null,1]
[null,1,null,null,null,null,null,null,null,null,null,null,null,null,{"$f":"'DATA UMUM'!D4","v":"Shikamaru, S.Pd."}]
[null,1,null,null,null,null,null,null,null,null,null,null,null,null,"Ninja Mahir"]
[null,1,null,null,null,null,null,null,null,null,null,null,null,null,{"$f":"\"NIP. \"&'DATA UMUM'!D5","v":"NIP. 012611"}]

{"sheet":"SP. Tugas","index":6,"n_rows":50,"n_cols":10,"rows_kept":50,"cut":false,"hidden":false,"merged":[[1,8,1,11],[0,8,0,11],[2,3,2,11],[7,3,7,11],[3,3,3,11],[4,3,4,11],[5,3,5,11],[6,3,6,11],[12,14,13,17],[11,14,11,17],[8,14,8,15],[46,4,46,5],[12,13,13,13],[45,4,45,5],[45,8,45,10],[12,3,12,11],[13,3,13,11],[36,4,36,11],[38,3,38,11],[9,3,9,11],[10,3,10,11],[40,9,40,11]]}
[null,null,null,null,null,null,null,"NOMOR BUKTI","KEGIATAN"]
["kjk",null,null,null,null,null,null,{"$f":"IFERROR(INDEX(NO_BUKTI,MATCH(I2,URAIAN,0)),\"\")","v":"BPU07"},"Transport kegiatan Kombel KKG Gugus 2 Sungai Dangin bulan Januari"]
[null,null,null,"PEMERINTAH NEGARA API"]
[null,null,null,"DINAS KENINJAAN"]
[null,null,null,"KOORDINATOR WILAYAH KONOHAGAKURE"]
[null,null,null,{"$f":"UPPER('DATA UMUM'!D2)","v":"SD NINJA 01 KONOHA"}]
[null,null,null,{"$f":"'DATA UMUM'!D10","v":"Desa Konohagakure, Negara Api. 666"}]
[null,null,null,{"$f":"\"email: \"&'DATA UMUM'!D11","v":"email: sdninja@konohagaku.re"}]
[]
[null,null,null,"SURAT PERINTAH TUGAS"]
[null,null,null,"Nomor: 422/….../SD.17/Adm/2024"]
[]
[null,null,null,{"$f":"\"Berdasarkan \"&IFERROR(VLOOKUP(I2,data_lampiran2,2,FALSE),\"PERLU DIISI\"&\"\")&\", maka yang bertandatangan di bawah ini Kepala Sekolah \"&'DATA UMUM'!D2","v":"Berdasarkan surat undangan rapat Kombel Gugus II Sungai Dangin nomor 422/12/SD.07/I/2024 tanggal 18 Januari 2024, maka yang bertandatangan di bawah ini Kepala Sekolah SD Ninja 01 Konoha"}]
[null,null,null,"MENUGASKAN"]
[null,1,null,"Kepada:","No","Nama","NIP","Jabatan"]
[null,{"$f":"IF(F16:F16<>\"\",1,0)","v":1},{"$f":"$I$2&\" \"&E16","v":"Transport kegiatan Kombel KKG Gugus 2 Sungai Dangin bulan Januari 1"},null,1,{"$f":"IFERROR(VLOOKUP(C16,data_lampiran3,5,FALSE),\"\")","v":"Shikamaru, S.Pd."},{"$f":"IFERROR(VLOOKUP(C16,data_lampiran3,6,FALSE),\" \")","v":"012611"},{"$f":"IFERROR(VLOOKUP(C16,data_lampiran3,7,FALSE),\"\")","v":"Kepala Sekolah"}]
[null,{"$f":"IF(F17:F17<>\"\",1,0)","v":1},{"$f":"$I$2&\" \"&E17","v":"Transport kegiatan Kombel KKG Gugus 2 Sungai Dangin bulan Januari 2"},null,2,{"$f":"IFERROR(VLOOKUP(C17,data_lampiran3,5,FALSE),\"\")","v":"Shikamaru, S.Pd."},"012611","Guru"]
[null,1,"Transport kegiatan Kombel KKG Gugus 2 Sungai Dangin bulan Januari 3",null,3,"Temari, S.Pd.","53-004","Guru"]
[null,1,"Transport kegiatan Kombel KKG Gugus 2 Sungai Dangin bulan Januari 4",null,4,"Tenten, S.Pd.",0,"Guru"]
[null,1,"Transport kegiatan Kombel KKG Gugus 2 Sungai Dangin bulan Januari 5",null,5,"Sakura, S.Pd.",0,"Guru"]
[null,1,"Transport kegiatan Kombel KKG Gugus 2 Sungai Dangin bulan Januari 6",null,6,"Kiba, S.Pd.",0,"Guru"]
[null,1,"Transport kegiatan Kombel KKG Gugus 2 Sungai Dangin bulan Januari 7",null,7,"Tenten, S.Pd.",0,"Guru"]
[null,0,"Transport kegiatan Kombel KKG Gugus 2 Sungai Dangin bulan Januari 8",null,8,"",{"$f":"IFERROR(VLOOKUP(C23,data_lampiran3,6,FALSE),\"\")","v":""},""]
[null,0,"Transport kegiatan Kombel KKG Gugus 2 Sungai Dangin bulan Januari 9",null,9,"","",""]
[null,0,"Transport kegiatan Kombel KKG Gugus 2 Sungai Dangin bulan Januari 10",null,10,"","",""]
[null,0,"Transport kegiatan Kombel KKG Gugus 2 Sungai Dangin bulan Januari 11",null,11,"","",""]
[null,0,"Transport kegiatan Kombel KKG Gugus 2 Sungai Dangin bulan Januari 12",null,12,"","",""]
[null,0,"Transport kegiatan Kombel KKG Gugus 2 Sungai Dangin bulan Januari 13",null,13,"","",""]
[null,0,"Transport kegiatan Kombel KKG Gugus 2 Sungai Dangin bulan Januari 14",null,14,"","",""]
[null,0,"Transport kegiatan Kombel KKG Gugus 2 Sungai Dangin bulan Januari 15",null,15,"","",""]
[null,0,"Transport kegiatan Kombel KKG Gugus 2 Sungai Dangin bulan Januari 16",null,16,"","",""]
[null,0,"Transport kegiatan Kombel KKG Gugus 2 Sungai Dangin bulan Januari 17",null,17,"","",""]
[null,0,"Transport kegiatan Kombel KKG Gugus 2 Sungai Dangin bulan Januari 18",null,18,"","",""]
[null,0,"Transport kegiatan Kombel KKG Gugus 2 Sungai Dangin bulan Januari 19",null,19,"","",""]
[null,0,"Transport kegiatan Kombel KKG Gugus 2 Sungai Dangin bulan Januari 20",null,20,"","",""]
[]
[null,null,null,"Untuk:",{"$f":"\"Menghadiri kegiatan \"&IFERROR(VLOOKUP(I2,data_lampiran2,3,FALSE),\"\")","v":"Menghadiri kegiatan Undangan Rapat Kombel Gugus II Sungai Dangin"}]
[null,null,null,{"$f":"\"Tugas tersebut dilaksanakan pada hari/tanggal:\"","v":"Tugas tersebut dilaksanakan pada hari/tanggal:"},null,null,{"$f":"IFERROR(VLOOKUP(I2,data_lampiran2,9,FALSE),\"\")","v":"2024-01-20"},{"$f":"\" di \"&IFERROR(VLOOKUP(I2,data_lampiran2,8,FALSE),\"\")","v":" di Kantor Ninja Konoha"}]
[null,null,null,"Demikian surat ini dibuat dengan sebenarnya agar dapat dipergunakan sebagaimana mestinya."]
[]
[null,null,null,null,null,null,null,null,null,{"$f":"G38","v":"2024-01-20"}]
[null,null,null,null,null,null,null,null,null,"Kepala Sekolah"]
[null,null,null,null,null,null,null,null,null,{"$f":"'DATA UMUM'!D2","v":"SD Ninja 01 Konoha"}]
[]
[]
[]
[]
[null,null,null,null,null,null,null,null,null,{"$f":"'DATA UMUM'!D4","v":"Shikamaru, S.Pd."}]
[null,null,null,null,null,null,null,null,null,"Ninja Mahir"]
[null,null,null,null,null,null,null,null,null,{"$f":"\"NIP \"&'DATA UMUM'!D5","v":"NIP 012611"}]

{"sheet":"Daftar Penerima","index":7,"n_rows":44,"n_cols":13,"rows_kept":44,"cut":false,"hidden":false,"merged":[[34,11,34,13],[9,3,9,13],[10,3,10,13],[1,9,1,11],[0,9,0,11],[9,16,9,19],[10,15,11,15],[10,16,11,19],[11,3,11,13],[2,3,2,13],[3,3,3,13],[4,3,4,13],[5,3,5,13],[6,3,6,13],[7,3,7,13]]}
[null,null,null,null,null,null,null,null,"NO BUKTI","KEGIATAN"]
["kjk",null,null,null,null,null,null,null,{"$f":"IFERROR(INDEX(NO_BUKTI,MATCH(J2,URAIAN,0)),\"\")","v":"BPU07"},"Transport kegiatan Kombel KKG Gugus 2 Sungai Dangin bulan Januari"]
[null,null,null,"PEMERINTAH NEGARA API"]
[null,null,null,"DINAS KENINJAAN"]
[null,null,null,"KOORDINATOR WILAYAH KONOHAGAKURE"]
[null,null,null,{"$f":"UPPER('DATA UMUM'!D2)","v":"SD NINJA 01 KONOHA"}]
[null,null,null,{"$f":"'DATA UMUM'!D10","v":"Desa Konohagakure, Negara Api. 666"}]
[null,null,null,{"$f":"\"email: \"&'DATA UMUM'!D11","v":"email: sdninja@konohagaku.re"}]
[null,null,null,null,null,null,null,null,null,null,null,"Nomor",{"$f":"\": \"&I2&\"/\"&\"BOSP/\"&'DATA UMUM'!D9","v":": BPU07/BOSP/2024"}]
[null,null,null,"DAFTAR PENERIMA"]
[null,null,null,{"$f":"J2","v":"Transport kegiatan Kombel KKG Gugus 2 Sungai Dangin bulan Januari"}]
[]
[null,1,null,"No","Nama","NIP","Jabatan","Volume","Satuan","Harga","Jumlah","Tanda tangan"]
[null,{"$f":"IF(E14:E14<>\"\",1,0)","v":1},{"$f":"$J$2&\" \"&L14","v":"Transport kegiatan Kombel KKG Gugus 2 Sungai Dangin bulan Januari 1"},1,{"$f":"IFERROR(VLOOKUP(C14,data_lampiran3,5,FALSE),\"\")","v":"Shikamaru, S.Pd."},{"$f":"IFERROR(VLOOKUP(C14,data_lampiran3,6,FALSE),\"\")","v":"012611"},{"$f":"IFERROR(VLOOKUP(C14,data_lampiran3,7,FALSE),\"ISI DULU DATANYA\")","v":"Kepala Sekolah"},{"$f":"IFERROR(VLOOKUP(C14,data_lampiran3,11,FALSE),\"\")","v":1},{"$f":"IFERROR(VLOOKUP(C14,data_lampiran3,12,FALSE),\"\")","v":"orang/kegiatan"},{"$f":"IFERROR(VLOOKUP(C14,data_lampiran3,13,FALSE),\"\")","v":150000},{"$f":"IFERROR(VLOOKUP(C14,data_lampiran3,14,FALSE),\"\")","v":150000},1]
[null,{"$f":"IF(E15:E15<>\"\",1,0)","v":1},{"$f":"$J$2&\" \"&L15","v":"Transport kegiatan Kombel KKG Gugus 2 Sungai Dangin bulan Januari 2"},2,{"$f":"IFERROR(VLOOKUP(C15,data_lampiran3,5,FALSE),\"\")","v":"Shikamaru, S.Pd."},"012611",{"$f":"IFERROR(VLOOKUP(C15,data_lampiran3,7,FALSE),\"\")","v":"Guru"},1,"orang/kegiatan",150000,150000,2]
[null,1,"Transport kegiatan Kombel KKG Gugus 2 Sungai Dangin bulan Januari 3",3,{"$f":"IFERROR(VLOOKUP(C16,data_lampiran3,5,FALSE),\"\")","v":"Temari, S.Pd."},"53-004","Guru",1,"orang/kegiatan",150000,150000,3]
[null,1,"Transport kegiatan Kombel KKG Gugus 2 Sungai Dangin bulan Januari 4",4,"Tenten, S.Pd.",0,"Guru",1,"orang/kegiatan",150000,150000,4]
[null,1,"Transport kegiatan Kombel KKG Gugus 2 Sungai Dangin bulan Januari 5",5,"Sakura, S.Pd.",0,"Guru",1,"orang/kegiatan",150000,150000,5]
[null,1,"Transport kegiatan Kombel KKG Gugus 2 Sungai Dangin bulan Januari 6",6,"Kiba, S.Pd.",0,"Guru",1,"orang/kegiatan",150000,150000,6]
[null,1,"Transport kegiatan Kombel KKG Gugus 2 Sungai Dangin bulan Januari 7",7,"Tenten, S.Pd.",0,"Guru",1,"orang/kegiatan",150000,150000,7]
[null,0,"Transport kegiatan Kombel KKG Gugus 2 Sungai Dangin bulan Januari 8",8,"","","","","","","",8]
[null,0,"Transport kegiatan Kombel KKG Gugus 2 Sungai Dangin bulan Januari 9",9,"","","","","","","",9]
[null,0,"Transport kegiatan Kombel KKG Gugus 2 Sungai Dangin bulan Januari 10",10,"","","","","","","",10]
[null,0,"Transport kegiatan Kombel KKG Gugus 2 Sungai Dangin bulan Januari 11",11,"","","","","","","",11]
[null,0,"Transport kegiatan Kombel KKG Gugus 2 Sungai Dangin bulan Januari 12",12,"","","","","","","",12]
[null,0,"Transport kegiatan Kombel KKG Gugus 2 Sungai Dangin bulan Januari 13",13,"","","","","","","",13]
[null,0,"Transport kegiatan Kombel KKG Gugus 2 Sungai Dangin bulan Januari 14",14,"","","","","","","",14]
[null,0,"Transport kegiatan Kombel KKG Gugus 2 Sungai Dangin bulan Januari 15",15,"","","","","","","",15]
[null,0,"Transport kegiatan Kombel KKG Gugus 2 Sungai Dangin bulan Januari 16",16,"","","","","","","",16]
[null,0,"Transport kegiatan Kombel KKG Gugus 2 Sungai Dangin bulan Januari 17",17,"","","","","","","",17]
[null,0,"Transport kegiatan Kombel KKG Gugus 2 Sungai Dangin bulan Januari 18",18,"","","","","","","",18]
[null,0,"Transport kegiatan Kombel KKG Gugus 2 Sungai Dangin bulan Januari 19",19,"","","","","","","",19]
[null,0,"Transport kegiatan Kombel KKG Gugus 2 Sungai Dangin bulan Januari 20",20,"","","","","","","",20]
[]
[null,null,null,null,null,null,null,null,null,null,null,{"$f":"IFERROR(VLOOKUP(Q11,data_lampiran2,9,FALSE),\"\")","v":""}]
[null,null,null,null,"Kepala Sekolah"]
[null,null,null,null,{"$f":"'DATA UMUM'!D2","v":"SD Ninja 01 Konoha"},null,null,null,null,null,null,"Bendahara"]
[]
[]
[]
[]
[null,null,null,null,{"$f":"'DATA UMUM'!D4","v":"Shikamaru, S.Pd."},null,null,null,null,null,null,{"$f":"'DATA UMUM'!D6","v":"Temari, S.Pd."}]
[null,null,null,null,"Pembina VI/a",null,null,null,null,null,null,{"$f":"\"NIP \"&'DATA UMUM'!D7","v":"NIP 53-004"}]
[null,null,null,null,{"$f":"\"NIP \"&'DATA UMUM'!D5","v":"NIP 012611"}]

{"sheet":"L. UPAH KERJA","index":8,"n_rows":24,"n_cols":14,"rows_kept":24,"cut":false,"hidden":false,"merged":[[0,0,0,11],[11,0,11,9],[16,1,16,3],[5,3,5,7],[5,0,7,0],[5,1,7,1],[5,2,7,2],[5,8,7,8],[5,9,7,9],[5,10,7,10],[5,11,7,11],[16,8,16,11],[22,1,22,3],[23,1,23,3],[17,8,17,10],[22,8,22,10],[23,8,23,10],[17,1,17,3]]}
["DAFTAR HADIR DAN PENERIMAAN UPAH KERJA"]
[]
["PEKERJAAN",null,": Menebas rumput lapangan sekolah",null,null,null,null,null,null,null,null,null,null,"CAPEK DEHH"]
["LOKASI",null,{"$f":"\": \"&'DATA UMUM'!D2","v":": SD Ninja 01 Konoha"},null,null,null,null,null,null,null,null,null,null,"YG INI MANUAL AJA YA :)"]
[]
["NO","NAMA","PROFESI","HARI KERJA",null,null,null,null,"JUMLAH HARI KERJA","HARGA SATUAN","JUMLAH YANG DITERIMA","TANDA TANGAN"]
[null,null,null,"SENIN","SELASA","RABU","KAMIS","JUMAT"]
[]
[1,"Kiba","Honor",null,"2024-01-09","2024-01-10","2024-01-11","2024-01-12",4,100000,{"$f":"I9*J9","v":400000}]
[2,"Choji","Honor",null,null,null,"2024-01-11","2024-01-12",2,100000,{"$f":"I10*J10","v":200000}]
[]
["JUMLAH",null,null,null,null,null,null,null,null,null,{"$f":"SUM(K9:K10)","v":600000}]
[]
[]
[]
[]
[null,"SETUJU DIBAYAR OLEH",null,null,null,null,null,null,"Periji, 17 November 2024"]
[null,"KEPALA SEKOLAH",null,null,null,null,null,null,"BENDAHARA SEKOLAH"]
[]
[]
[]
[]
[null,{"$f":"'DATA UMUM'!D4","v":"Shikamaru, S.Pd."},null,null,null,null,null,null,{"$f":"'DATA UMUM'!D6","v":"Temari, S.Pd."}]
[null,{"$f":"\"NIP. \"&'DATA UMUM'!D5","v":"NIP. 012611"},null,null,null,null,null,null,{"$f":"\"NIP. \"&'DATA UMUM'!D7","v":"NIP. 53-004"}]

{"sheet":"L. Rapat","index":9,"n_rows":33,"n_cols":6,"rows_kept":33,"cut":false,"hidden":false,"merged":[[20,3,20,4],[12,5,12,6],[13,5,13,6],[14,5,14,6],[15,5,15,6],[16,5,16,6],[17,5,17,6],[18,5,18,6],[19,5,19,6],[20,5,20,6],[20,1,20,2],[18,1,18,2],[12,3,12,4],[13,3,13,4],[14,3,14,4],[15,3,15,4],[16,3,16,4],[17,3,17,4],[18,3,18,4],[19,3,19,4],[13,1,13,2],[14,1,14,2],[15,1,15,2],[16,1,16,2],[17,1,17,2],[19,1,19,2],[12,1,12,2],[0,0,0,8],[1,0,1,8],[2,0,2,8],[3,0,3,8],[4,0,4,8],[5,0,5,8],[7,0,7,8]]}
["PEMERINTAH NEGARA API"]
["DINAS KENINJAAN"]
["KOORDINATOR WILAYAH KONOHAGAKURE"]
[{"$f":"UPPER('DATA UMUM'!D2)","v":"SD NINJA 01 KONOHA"}]
[{"$f":"\"Alamat: \"&'DATA UMUM'!D10","v":"Alamat: Desa Konohagakure, Negara Api. 666"}]
[{"$f":"\"email: \"&'DATA UMUM'!D11","v":"email: sdninja@konohagaku.re"}]
[]
["DAFTAR HADIR"]
[]
["Hari/tanggal",null,":"]
["Kegiatan",null,":"]
[]
["No","Nama",null,"Jabatan",null,"Tanda tangan"]
[1,{"$f":"'DATA UMUM'!B17","v":"Shikamaru, S.Pd."},null,"Kepala Sekolah",null,1]
[2,{"$f":"'DATA UMUM'!B18","v":"Temari, S.Pd."},null,"Guru Kelas",null,2]
[3,{"$f":"'DATA UMUM'!B19","v":"Tenten, S.Pd."},null,"Guru Kelas",null,3]
[4,{"$f":"'DATA UMUM'!B20","v":"Sakura, S.Pd."},null,"Guru Kelas",null,4]
[5,{"$f":"'DATA UMUM'!B21","v":"Kiba, S.Pd."},null,"Guru Olahraga",null,5]
[6,{"$f":"'DATA UMUM'!B22","v":0},null,"Guru Agama Katolik",null,6]
[7,{"$f":"'DATA UMUM'!B23","v":0},null,"Guru Kelas",null,7]
[8,{"$f":"'DATA UMUM'!B24","v":0},null,"Guru Kelas",null,8]
[]
[]
[]
[null,null,null,null,"Periji,"]
[null,null,null,null,"Plt. Kepala Sekolah"]
[null,null,null,null,{"$f":"'DATA UMUM'!D2","v":"SD Ninja 01 Konoha"}]
[]
[]
[]
[]
[null,null,null,null,{"$f":"'DATA UMUM'!D4","v":"Shikamaru, S.Pd."}]
[null,null,null,null,{"$f":"\"NIP. \"&'DATA UMUM'!D5","v":"NIP. 012611"}]